program: Gaussian 09
title: 000071813
version: EM64L-G09RevD.01
frameworkgroup: C1[X(C5H10Cl2O2)]
method: RPBEPBE
basis: SDD
operation: Freq
keyword: #p
keyword: freq=noraman
keyword: PBEPBE/SDD
title: #p freq=noraman PBEPBE/SDD
converged: YES YES NO NO
title: Mulliken charges:
elementType: Cl Cl O O C C C C C H H H H H H H H H H
charge: -0.084674 -0.076017 -0.467965 -0.431459 0.348200 -0.358990 -0.413063 -0.629341 -0.690273 0.215526 0.227419 0.269684 0.213966 0.274576 0.305795 0.291642 0.294794 0.360034 0.350145
chargesum: 0.00000
title: Mulliken charges with hydrogens summed into heavy atoms:
elementType: Cl Cl O O C C C C C
charge: -0.084674 -0.076017 -0.107931 -0.081314 0.348200 0.083955 0.070587 -0.048970 -0.103837
polarizability: 8.93491396e+01 -1.39717841e+00 7.93410697e+01 -6.61633778e+00 8.12077503e-02 6.59574678e+01
1716.lowfreq: -22.5027 0.0029 0.0032 0.0035 2.2958 8.9426 64.2490 100.0431 107.3884
frequency: 64.1644 100.0322 107.3708 129.0535 148.0005 184.4822 211.0206 256.9134 266.9250 320.4319 323.7973 335.6993 494.6144 527.9976 562.8801 668.5416 679.3104 772.5796 856.5608 863.4295 904.2313 970.1407 985.0033 989.5897 1063.5306 1091.3025 1132.9476 1172.7379 1194.6620 1222.2148 1254.2519 1266.9332 1299.0628 1310.7645 1355.4117 1384.9219 1401.4341 1422.6870 1444.2678 1468.4131 1472.6697 2961.1516 2991.3985 3020.9161 3064.1164 3065.0208 3105.6267 3149.5089 3158.4277 3527.8866 3601.3032
redmass: 10.8593 5.0602 4.8957 7.1349 2.5299 1.3732 2.9712 4.1834 3.5589 2.1958 4.7511 4.4070 1.3741 1.7738 3.2967 6.9066 6.1067 3.8584 1.6411 2.2153 1.7094 1.6322 7.1595 4.6416 1.5595 1.5482 1.4789 1.1563 1.1352 1.3164 1.3295 1.6222 1.3509 1.4634 1.2086 1.2449 1.2993 1.1165 1.0972 1.0733 1.0812 1.0541 1.0664 1.1086 1.0563 1.0571 1.0987 1.1110 1.1100 1.0660 1.0669
irintensity: 4.9522 0.3574 6.5187 4.5466 30.9446 119.3740 6.0900 16.8952 20.9660 1.6067 0.4434 7.8510 79.0746 95.1350 24.2264 32.9931 36.1388 9.0019 34.6674 49.7687 10.3973 29.7349 54.9594 57.8359 28.0171 0.2210 17.6030 18.4235 11.1309 5.3476 3.5771 8.8168 31.5975 15.1428 18.1829 12.3878 2.8617 15.0085 12.6753 10.5188 10.3384 44.6253 36.9520 27.0502 15.4193 10.8410 6.0983 1.1337 1.0723 12.2344 10.4820
temp: 298.150 k
press: 1.00000 atm
elementType: 17 17 8 8 6 6 6 6 6 1 1 1 1 1 1 1 1 1 1
symmnumber: 1
zpe: 390738.3 jmol-1
zpe.correction: 0.148824 hartree
zpe.thermalcorrener: 0.159947 hartree
zpe.thermalcorrenthalpy: 0.160891 hartree
zpe.thermalcorrgfe: 0.111432 hartree
zpe.sumelectzpe: -1266.331201 hartree
zpe.sumelectthermal: -1266.320078 hartree
zpe.sumelectthermalent: -1266.319134 hartree
zpe.sumelectthermalfe: -1266.368594 hartree
dipole: -0.5996 1.1614 1.2081
dipole: 1.7799
quadrupole: -71.5768 -75.2882 -62.8228
quadrupole: -7.3922 -2.9850 2.9219
quadrupole: -1.6808 -5.3923 7.0731 -7.3922 -2.9850 2.9219
hfenergy: -1266.4800257 hartree
pointgroup: C01 [X(C5H10Cl2O2)]
dipole: -0.2372717 -0.4628812 -0.4688289 debye
dipolederiv: -0.4684361 0.2272672 -0.0381247 0.2419735 -0.3805665 0.0369795 -0.1091797 0.1019551 -0.2394211 -0.4539669 -0.1807698 -0.0581338 -0.1708192 -0.3765026 -0.0189167 -0.1126906 -0.0793081 -0.2240155 -0.6588959 -0.1191273 0.1688345 -0.1161559 -0.6704176 0.1415142 0.2067174 0.1635013 -0.2855264 -0.7565945 0.322462 0.0088002 0.3195249 -0.4032436 0.0702656 0.0722421 0.0323813 -0.5305194 -0.2392646 0.0691707 -0.0434239 0.06735 -0.1674496 0.0285263 -0.2659145 0.0489967 -0.1390527 0.4690773 0.1326646 -0.1236343 0.1620966 0.464483 -0.1242729 -0.0190631 -0.036478 0.2438211 0.5654036 -0.19299 -0.0532618 -0.2137587 0.3268059 0.0199194 0.0474595 -0.0854455 0.3200573 0.4935048 -0.3455304 0.1345827 -0.3480949 0.3671911 -0.1115837 0.1139939 -0.0866792 0.1696836 0.4796834 0.2884084 0.145223 0.3228788 0.3099862 0.1042422 0.1493348 0.0736239 0.1740262 -0.0264337 0.0222578 -0.078152 0.0290664 -0.0019124 0.1398147 -0.0299647 0.1081244 -0.0554593 -0.0220079 0.0441591 0.1303628 0.0438738 -0.0376753 -0.0675999 0.104081 -0.030546 -0.0164369 0.0642231 -0.0226709 0.0731577 -0.0414273 -0.0155702 0.0624778 0.049528 0.0361653 0.0798223 -0.0053209 -0.0071028 -0.0447765 -0.0083084 0.0036689 -0.1527864 -0.0197803 -0.0925063 -0.0914243 0.0033009 -0.0095355 -0.1182946 0.0251928 -0.0152336 -0.0403288 -0.0822474 -0.0296269 0.0276013 0.0028515 0.0288341 0.0201006 0.0104471 0.0557992 0.1100712 0.0194421 0.0820806 0.0370745 -0.022847 -0.0285721 0.0250276 -0.0037767 0.0396208 -0.1227178 0.0216738 -0.0774119 -0.0012264 0.0357909 0.0130417 -0.1114113 -0.0307881 0.0033643 0.0343125 -0.0811556 0.0125711 0.0709819 0.2588583 -0.1023603 -0.0796694 -0.1077082 0.2873167 -0.0608278 -0.1104284 -0.0996029 0.1616179 0.2810736 -0.1396065 0.042793 -0.1815664 0.2103354 -0.0490895 0.0459517 -0.041795 0.2983958 unknown
polarizability: 89.4313965|1.5103748|79.3547386|6.4293673|-0.0385718|65.861542 unknown
InChI: InChI=1S/C5H10Cl2O2/c6-1-5(2-7,3-8)4-9/h8-9H,1-4H2
charge 0 multiplicity 1
19 atoms
Cl -2.146126 1.840349 0.012417
Cl 2.178188 1.77909 -0.094067
O  -1.726645 -1.767001 0.002678
O  2.042676 -1.514943 0.07237
C  -0.010476 -0.060233 -0.033003
C  -0.871155 -1.003113 -0.915472
C  0.937808 -0.949967 0.849531
C  -0.885324 0.756539 0.931216
C  0.789786 0.832104 -0.993493
H  -1.48247 -0.40705 -1.624023
H  -0.190685 -1.678257 -1.4740
H  0.362184 -1.811082 1.221806
H  1.317487 -0.358167 1.705906
H  -0.287372 1.466982 1.521747
H  -1.493748 0.098805 1.566149
H  1.314548 0.241856 -1.758359
H  0.16589 1.616421 -1.445435
H  -2.376301 -2.303794 -0.512789
H  2.744335 -0.818438 -0.018878
