program: Orca
programVersion: 5.0.2
elementType: O O O C C C C C C C C C C C C C C C C C C C C C C C H H H H H H H H H H H H H H H H H H H H H H H H H H
charge: 0
multiplicity: 1
keywords: wb97x-d3
keywords: def2-TZVPP
keywords: def2/J RIJCOSX
keywords: DEFGRID2
keywords: scfconv7
keywords: smallprint printgap noloewdin
keywords: NOSOSCF
formula: C23H26O3
InChI: InChI=1/C23H26O3/c1-16(2)13-20-21(23(20,3)4)22(24)25-15-17-9-8-12-19(14-17)26-18-10-6-5-7-11-18/h5-14,20-21H,15H2,1-4H3
52 atoms
O  -2.12118 2.018778 0.414481
O  -2.70543 0.869508 -1.41024
O  3.078818 1.207256 0.875633
C  -4.698694 -0.670787 0.363721
C  -3.392731 -1.309506 0.690144
C  -3.532453 0.214974 0.745874
C  -5.782302 -0.766427 1.413747
C  -5.249436 -0.702207 -1.041414
C  -2.5307 -1.956115 -0.329098
C  -2.773453 1.033342 -0.221905
C  -1.204795 -2.049098 -0.231031
C  -0.379099 -2.689433 -1.303069
C  -0.429513 -1.47448 0.913905
C  -1.298482 2.864682 -0.386022
C  0.003287 2.214291 -0.76622
C  0.957259 1.95741 0.213009
C  0.267231 1.86418 -2.083457
C  2.170056 1.377956 -0.126761
C  1.486498 1.294258 -2.417733
C  2.446498 1.051107 -1.44935
C  3.865496 0.094895 0.922536
C  3.419868 -1.162581 0.531508
C  5.143122 0.254097 1.442279
C  4.263869 -2.254534 0.662864
C  5.971478 -0.84856 1.577382
C  5.54022 -2.107042 1.184957
H  -3.333428 -1.756714 1.679608
H  -3.570091 0.641085 1.741965
H  -6.487841 0.0615 1.324119
H  -5.375928 -0.747096 2.426091
H  -6.343556 -1.695837 1.301809
H  -4.485133 -0.679606 -1.811101
H  -5.909214 0.150403 -1.210062
H  -5.84438 -1.607982 -1.175483
H  -3.018857 -2.368938 -1.205355
H  0.212983 -3.51844 -0.906567
H  0.326291 -1.967689 -1.724758
H  -0.990694 -3.072402 -2.118917
H  0.304119 -2.189427 1.294159
H  -1.057121 -1.166538 1.747802
H  0.127238 -0.592371 0.585931
H  -1.115551 3.739094 0.239045
H  -1.835512 3.194347 -1.277516
H  0.766853 2.211914 1.249032
H  -0.482453 2.031136 -2.844698
H  1.695984 1.035814 -3.447292
H  3.399233 0.616138 -1.722079
H  2.422995 -1.296245 0.132886
H  5.475834 1.238771 1.743167
H  3.911461 -3.231736 0.359645
H  6.964917 -0.718471 1.98585
H  6.191108 -2.964587 1.287057
totalener: -1117.84272667 hartree
nucrepener: 2321.89582901 hartree
electener: -3439.73855568 hartree
oneelecener: -6132.64328641 hartree
twoeener: 2692.90473073 hartree
kineticenergy: 1112.86578795 hartree
xcener: -110.236671730243 hartree
chargesum: -0.0000000
charge: -0.268623 -0.383710 -0.299002 0.139026 -0.056553 -0.116966 -0.244132 -0.276758 -0.177263 0.359721 0.043163 -0.225578 -0.275232 0.053292 -0.004896 -0.244029 -0.092361 0.240058 -0.142618 -0.153837 0.255836 -0.133738 -0.195730 -0.148605 -0.102370 -0.131972 0.088791 0.080404 0.090247 0.070238 0.087626 0.103653 0.085783 0.086384 0.083236 0.085700 0.082340 0.083429 0.099301 0.094267 0.060261 0.111414 0.101651 0.117431 0.113464 0.126561 0.132472 0.102431 0.123303 0.123297 0.124493 0.124698
qa: -0.2686 -0.3837 -0.2990 0.1390 -0.0566 -0.1170 -0.2441 -0.2768 -0.1773 0.3597 0.0432 -0.2256 -0.2752 0.0533 -0.0049 -0.2440 -0.0924 0.2401 -0.1426 -0.1538 0.2558 -0.1337 -0.1957 -0.1486 -0.1024 -0.1320 0.0888 0.0804 0.0902 0.0702 0.0876 0.1037 0.0858 0.0864 0.0832 0.0857 0.0823 0.0834 0.0993 0.0943 0.0603 0.1114 0.1017 0.1174 0.1135 0.1266 0.1325 0.1024 0.1233 0.1233 0.1245 0.1247
va: 2.1165 2.1028 2.1139 3.7387 3.9004 3.8267 3.9044 3.9073 3.8879 4.1655 3.6571 3.9423 3.9523 3.8718 3.6741 3.9744 3.9405 3.8028 3.9539 3.9127 3.7860 3.8977 4.0132 4.0045 3.9493 3.9525 1.0081 1.0321 1.0050 1.0070 1.0051 1.0206 1.0049 0.9979 1.0133 0.9995 0.9968 1.0140 1.0035 1.0165 1.0100 0.9926 1.0096 1.0267 1.0220 1.0014 1.0027 1.0024 1.0149 1.0021 0.9991 1.0003
dispcorr: -0.028852333 hartree
energy: -1117.871579004373
dipole: -17.31259 17.41015 0.09756 -14.06926 13.89983 -0.16944 -0.42393 0.66021 0.23628
magnitude: 0.30668 au
magnitude: 0.77953 debye
