program: Orca
programVersion: 5.0.2
elementType: O O O C C C C C C C C C C C C C C C C C C C C C C C H H H H H H H H H H H H H H H H H H H H H H H H H H
charge: 0
multiplicity: 1
keywords: wb97x-d3
keywords: def2-TZVPP
keywords: def2/J RIJCOSX
keywords: DEFGRID2
keywords: scfconv7
keywords: smallprint printgap noloewdin
keywords: NOSOSCF
formula: C23H26O3
InChI: InChI=1/C23H26O3/c1-16(2)13-20-21(23(20,3)4)22(24)25-15-17-9-8-12-19(14-17)26-18-10-6-5-7-11-18/h5-14,20-21H,15H2,1-4H3
52 atoms
O  -2.170664 2.105305 0.269646
O  -2.5204 0.718399 -1.442207
O  2.838679 1.108936 0.932586
C  -4.593428 -0.692272 0.387014
C  -3.288546 -1.305177 0.753707
C  -3.429747 0.222338 0.724596
C  -5.681094 -0.727112 1.435332
C  -5.139247 -0.793819 -1.015772
C  -2.424149 -2.019577 -0.216469
C  -2.68493 0.998814 -0.279209
C  -1.10599 -2.173546 -0.069315
C  -0.282385 -2.893929 -1.091028
C  -0.342889 -1.59366 1.081666
C  -1.383414 2.951101 -0.571765
C  -0.037427 2.360714 -0.887474
C  0.799366 1.952478 0.146331
C  0.390231 2.232758 -2.20301
C  2.053949 1.43435 -0.13768
C  1.653833 1.727462 -2.475869
C  2.496852 1.327738 -1.451048
C  3.651388 0.01069 0.909505
C  3.301774 -1.17468 0.272885
C  4.84056 0.104175 1.620758
C  4.157846 -2.263879 0.351008
C  5.681553 -0.99596 1.697241
C  5.349045 -2.182968 1.059043
H  -3.22697 -1.679542 1.772467
H  -3.480296 0.699189 1.696679
H  -6.243084 -1.66124 1.371984
H  -6.387238 0.094254 1.29721
H  -5.278127 -0.65228 2.446312
H  -4.377812 -0.839109 -1.788257
H  -5.784441 0.058578 -1.237212
H  -5.749573 -1.694988 -1.102747
H  -2.902009 -2.44463 -1.093815
H  0.262408 -3.730165 -0.645304
H  0.471424 -2.227236 -1.519925
H  -0.887883 -3.282105 -1.910138
H  -0.974596 -1.329133 1.92792
H  0.181229 -0.685556 0.773144
H  0.420238 -2.287122 1.439676
H  -1.268485 3.871081 0.001491
H  -1.923218 3.197748 -1.488054
H  0.484622 2.042036 1.179939
H  -0.260335 2.532338 -3.014993
H  1.989462 1.639559 -3.501014
H  3.483043 0.942754 -1.677158
H  2.372483 -1.260061 -0.275715
H  5.099677 1.032074 2.115358
H  3.882387 -3.185745 -0.144898
H  6.60541 -0.918829 2.255777
H  6.008884 -3.03846 1.117117
elementType: O C H
totalener: -1117.86555750 hartree
nucrepener: 2323.01611143 hartree
electener: -3440.88166893 hartree
oneelecener: -6135.99089313 hartree
twoeener: 2695.10922420 hartree
cpcmener: -0.02594275 hartree
kineticenergy: 1112.82041499 hartree
xcener: -110.232424332692 hartree
chargesum: 0.0000000
charge: -0.294381 -0.461870 -0.331137 0.135249 -0.028573 -0.101312 -0.262319 -0.299520 -0.251866 0.385432 0.012775 -0.247251 -0.292946 0.098442 0.040151 -0.320765 -0.191081 0.294300 -0.141904 -0.194677 0.330628 -0.215351 -0.246273 -0.171788 -0.126328 -0.176627 0.108033 0.089436 0.093589 0.095161 0.085867 0.094426 0.100188 0.098205 0.121463 0.097353 0.095583 0.095893 0.106128 0.080981 0.107681 0.123251 0.111542 0.135736 0.141409 0.158383 0.154852 0.148985 0.143907 0.156777 0.156853 0.157307
qa: -0.2944 -0.4619 -0.3311 0.1352 -0.0286 -0.1013 -0.2623 -0.2995 -0.2519 0.3854 0.0128 -0.2473 -0.2929 0.0984 0.0402 -0.3208 -0.1911 0.2943 -0.1419 -0.1947 0.3306 -0.2154 -0.2463 -0.1718 -0.1263 -0.1766 0.1080 0.0894 0.0936 0.0952 0.0859 0.0944 0.1002 0.0982 0.1215 0.0974 0.0956 0.0959 0.1061 0.0810 0.1077 0.1233 0.1115 0.1357 0.1414 0.1584 0.1549 0.1490 0.1439 0.1568 0.1569 0.1573
va: 2.1105 2.0304 2.0728 3.7505 3.8174 3.8396 3.8983 3.8947 3.8333 4.1156 3.6450 3.9341 3.9676 3.8053 3.6039 3.9778 3.9516 3.6950 3.9068 3.9047 3.6343 3.8850 4.0014 3.9406 3.8918 3.9042 1.0068 1.0318 1.0024 1.0027 1.0047 1.0184 1.0003 0.9984 1.0015 0.9972 0.9931 1.0095 1.0096 0.9947 1.0014 0.9924 1.0085 1.0257 1.0057 0.9908 0.9964 0.9887 1.0095 0.9925 0.9893 0.9903
dispcorr: -0.028401517 hartree
energy: -1117.893959013915
dipole: -16.46997 16.56238 0.09241 -14.25331 14.12520 -0.12811 0.22668 0.23730 0.46398
magnitude: 0.49013 au
magnitude: 1.24582 debye
