program: Orca
programVersion: 5.0.2
elementType: O O O C C C C C C C C C C C C C C C C C C C C C C C H H H H H H H H H H H H H H H H H H H H H H H H H H
charge: 0
multiplicity: 1
keywords: wb97x-d3
keywords: def2-TZVPP
keywords: def2/J RIJCOSX
keywords: DEFGRID2
keywords: scfconv7
keywords: smallprint printgap noloewdin
keywords: NOSOSCF
formula: C23H26O3
InChI: InChI=1/C23H26O3/c1-16(2)13-20-21(23(20,3)4)22(24)25-15-17-9-8-12-19(14-17)26-18-10-6-5-7-11-18/h5-14,20-21H,15H2,1-4H3
52 atoms
O  -1.707077 0.147148 -0.232501
O  -3.124103 -1.547975 0.07336
O  4.132415 -0.206328 0.05162
C  -5.37825 0.594413 -0.160481
C  -4.96705 0.640539 1.269119
C  -3.90298 0.725234 0.171645
C  -5.99885 1.843068 -0.742803
C  -5.943976 -0.670993 -0.755883
C  -5.087449 -0.531637 2.172418
C  -2.921609 -0.35899 0.000681
C  -4.275644 -0.789571 3.20056
C  -4.495363 -1.972118 4.093008
C  -3.080634 0.048529 3.53466
C  -0.634253 -0.771153 -0.432613
C  0.606461 0.011682 -0.750188
C  1.822073 -0.420843 -0.236915
C  0.576762 1.119726 -1.592891
C  2.99655 0.250095 -0.552037
C  1.754365 1.787046 -1.893218
C  2.971975 1.366196 -1.377191
C  5.346369 -0.151669 -0.574707
C  6.447238 0.129522 0.223352
C  5.506351 -0.431486 -1.926936
C  7.716538 0.131009 -0.33642
C  6.781214 -0.414115 -2.475176
C  7.890051 -0.133747 -1.687938
H  -5.111559 1.599982 1.760008
H  -3.484954 1.713608 0.019896
H  -5.591513 2.749768 -0.29292
H  -7.078261 1.848342 -0.576947
H  -5.828759 1.900849 -1.819845
H  -5.7447 -0.71405 -1.828516
H  -7.028484 -0.678715 -0.625898
H  -5.555702 -1.582682 -0.311048
H  -5.923518 -1.201973 1.994082
H  -4.606023 -1.663472 5.136051
H  -3.638507 -2.650757 4.061822
H  -5.383368 -2.540291 3.81544
H  -2.164383 -0.544441 3.463551
H  -3.133854 0.408399 4.565633
H  -2.9667 0.915189 2.886071
H  -0.872192 -1.449168 -1.257436
H  -0.482485 -1.380261 0.461714
H  1.86291 -1.279877 0.423068
H  -0.356572 1.469531 -2.014438
H  1.72851 2.655447 -2.538885
H  3.877809 1.910007 -1.612957
H  6.308434 0.337646 1.277041
H  4.653884 -0.666577 -2.551681
H  8.572395 0.346293 0.290306
H  6.905213 -0.630124 -3.528695
H  8.880651 -0.126477 -2.123236
elementType: O C H
totalener: -1117.86672706 hartree
nucrepener: 2140.99663639 hartree
electener: -3258.86336346 hartree
oneelecener: -5771.57499812 hartree
twoeener: 2512.71163466 hartree
cpcmener: -0.02547221 hartree
kineticenergy: 1112.79139909 hartree
xcener: -110.224898687145 hartree
chargesum: 0.0000000
charge: -0.288407 -0.466618 -0.326246 0.135045 -0.022470 -0.077612 -0.263697 -0.298812 -0.272104 0.373188 -0.017066 -0.224390 -0.265189 0.096474 0.035158 -0.263380 -0.227493 0.276320 -0.141798 -0.203695 0.300595 -0.255546 -0.207460 -0.118427 -0.141379 -0.188243 0.112436 0.095066 0.085626 0.093362 0.095517 0.099213 0.098216 0.096343 0.120353 0.094182 0.094678 0.088942 0.097635 0.107013 0.092429 0.112805 0.107903 0.131319 0.141312 0.157882 0.155694 0.144513 0.156928 0.157607 0.158948 0.157330
qa: -0.2884 -0.4666 -0.3262 0.1350 -0.0225 -0.0776 -0.2637 -0.2988 -0.2721 0.3732 -0.0171 -0.2244 -0.2652 0.0965 0.0352 -0.2634 -0.2275 0.2763 -0.1418 -0.2037 0.3006 -0.2555 -0.2075 -0.1184 -0.1414 -0.1882 0.1124 0.0951 0.0856 0.0934 0.0955 0.0992 0.0982 0.0963 0.1204 0.0942 0.0947 0.0889 0.0976 0.1070 0.0924 0.1128 0.1079 0.1313 0.1413 0.1579 0.1557 0.1445 0.1569 0.1576 0.1589 0.1573
va: 2.1149 2.0240 2.0777 3.7349 3.8342 3.8313 3.9015 3.8948 3.8596 4.0878 3.7140 3.9261 3.9433 3.8046 3.7479 4.0753 3.9600 3.7577 3.9174 3.9234 3.6776 4.0098 3.9172 3.8820 3.8905 3.9084 1.0057 1.0263 1.0046 1.0024 1.0023 1.0010 0.9982 1.0160 1.0013 0.9966 0.9967 1.0072 0.9981 0.9994 1.0068 0.9952 1.0031 1.0203 1.0156 0.9918 0.9967 1.0091 0.9973 0.9892 0.9903 0.9909
dispcorr: -0.023248503 hartree
energy: -1117.889975567885
dipole: -30.26746 30.57065 0.30319 0.74113 0.33790 1.07903 8.68711 -9.07466 -0.38755
magnitude: 1.18593 au
magnitude: 3.01439 debye
