program: Orca
programVersion: 5.0.2
elementType: O O O C C C C C C C C C C C C C C C C C C C C C C C H H H H H H H H H H H H H H H H H H H H H H H H H H
charge: 0
multiplicity: 1
keywords: wb97x-d3
keywords: def2-TZVPP
keywords: def2/J RIJCOSX
keywords: DEFGRID2
keywords: scfconv7
keywords: smallprint printgap noloewdin
keywords: NOSOSCF
formula: C23H26O3
InChI: InChI=1/C23H26O3/c1-16(2)13-20-21(23(20,3)4)22(24)25-15-17-9-8-12-19(14-17)26-18-10-6-5-7-11-18/h5-14,20-21H,15H2,1-4H3
52 atoms
O  -1.53912 0.584798 -0.400528
O  -2.463049 -1.442327 -0.494499
O  4.351998 1.387877 -1.431659
C  -5.175772 0.02434 -0.052225
C  -4.638333 -0.190025 1.319405
C  -3.749462 0.447006 0.248564
C  -6.137167 1.172853 -0.251927
C  -5.474055 -1.151907 -0.949244
C  -4.381339 -1.545901 1.867064
C  -2.56223 -0.263348 -0.252002
C  -3.424901 -1.849621 2.747207
C  -3.268515 -3.240327 3.281323
C  -2.423365 -0.856171 3.24962
C  -0.307527 0.051192 -0.863707
C  0.720576 1.145341 -0.926601
C  2.043234 0.754674 -1.119393
C  0.409662 2.496697 -0.835236
C  3.045324 1.708897 -1.201136
C  1.423098 3.44257 -0.931956
C  2.742124 3.061634 -1.107063
C  4.910832 0.253715 -0.911478
C  4.623602 -0.206516 0.368473
C  5.848465 -0.397374 -1.701897
C  5.276182 -1.335081 0.844047
C  6.50266 -1.516096 -1.207177
C  6.216008 -1.994772 0.063754
H  -4.955443 0.539963 2.060275
H  -3.600887 1.515037 0.358755
H  -6.090052 1.55057 -1.275286
H  -5.924765 2.005842 0.41978
H  -7.163837 0.851314 -0.064361
H  -5.370762 -0.871499 -1.999137
H  -6.507809 -1.469223 -0.797764
H  -4.838754 -2.015285 -0.774402
H  -5.052683 -2.336247 1.543242
H  -2.276618 -3.638873 3.051923
H  -4.009341 -3.925998 2.869902
H  -3.362752 -3.256206 4.370443
H  -1.416657 -1.123634 2.915551
H  -2.392533 -0.853595 4.342278
H  -2.62202 0.16229 2.920205
H  -0.438554 -0.393081 -1.855092
H  0.03827 -0.742076 -0.195202
H  2.280597 -0.299877 -1.20365
H  -0.609609 2.82683 -0.690815
H  1.180415 4.495086 -0.861479
H  3.531081 3.800215 -1.174411
H  3.903086 0.303974 0.994916
H  6.067143 -0.023911 -2.694662
H  5.048521 -1.695322 1.839105
H  7.235848 -2.018154 -1.82524
H  6.721878 -2.872274 0.444369
elementType: O C H
totalener: -1117.86611234 hartree
nucrepener: 2175.66638273 hartree
electener: -3293.53249507 hartree
oneelecener: -5840.73364828 hartree
twoeener: 2547.20115321 hartree
cpcmener: -0.02512318 hartree
kineticenergy: 1112.79744778 hartree
xcener: -110.228052022513 hartree
chargesum: 0.0000000
charge: -0.281996 -0.465654 -0.327409 0.131443 -0.022399 -0.083545 -0.262556 -0.299949 -0.268626 0.368805 -0.019955 -0.224632 -0.265165 0.090794 0.060685 -0.240496 -0.241744 0.270965 -0.120616 -0.253792 0.303769 -0.210508 -0.257612 -0.140742 -0.116814 -0.191549 0.111937 0.096602 0.095773 0.085694 0.092975 0.099872 0.098348 0.097332 0.120494 0.094301 0.088971 0.094733 0.099035 0.106065 0.093764 0.115804 0.110722 0.140071 0.147234 0.156008 0.145460 0.157145 0.145737 0.159605 0.157821 0.157795
qa: -0.2820 -0.4657 -0.3274 0.1314 -0.0224 -0.0835 -0.2626 -0.2999 -0.2686 0.3688 -0.0200 -0.2246 -0.2652 0.0908 0.0607 -0.2405 -0.2417 0.2710 -0.1206 -0.2538 0.3038 -0.2105 -0.2576 -0.1407 -0.1168 -0.1915 0.1119 0.0966 0.0958 0.0857 0.0930 0.0999 0.0983 0.0973 0.1205 0.0943 0.0890 0.0947 0.0990 0.1061 0.0938 0.1158 0.1107 0.1401 0.1472 0.1560 0.1455 0.1571 0.1457 0.1596 0.1578 0.1578
va: 2.1179 2.0252 2.0826 3.7298 3.8283 3.8350 3.9009 3.8970 3.8584 4.0921 3.7156 3.9266 3.9420 3.8336 3.6945 3.9713 3.9516 3.7346 3.9131 4.0039 3.6813 3.9160 4.0103 3.8906 3.8808 3.9124 1.0062 1.0229 1.0023 1.0047 1.0026 1.0008 0.9984 1.0153 1.0005 0.9965 1.0072 0.9968 0.9976 0.9997 1.0059 0.9940 0.9950 1.0077 1.0151 0.9905 1.0070 0.9968 1.0088 0.9900 0.9891 0.9908
dispcorr: -0.023490873 hartree
energy: -1117.889603209268
dipole: -28.82382 28.51848 -0.30534 -8.82486 9.27978 0.45493 12.19443 -11.53326 0.66117
magnitude: 0.85868 au
magnitude: 2.18259 debye
