program: Orca
programVersion: 5.0.2
elementType: O O O C C C C C C C C C C C C C C C C C C C C C C C H H H H H H H H H H H H H H H H H H H H H H H H H H
charge: 0
multiplicity: 1
keywords: wb97x-d3
keywords: def2-TZVPP
keywords: def2/J RIJCOSX
keywords: DEFGRID2
keywords: scfconv7
keywords: smallprint printgap noloewdin
keywords: NOSOSCF
formula: C23H26O3
InChI: InChI=1/C23H26O3/c1-16(2)13-20-21(23(20,3)4)22(24)25-15-17-9-8-12-19(14-17)26-18-10-6-5-7-11-18/h5-14,20-21H,15H2,1-4H3
52 atoms
O  -1.166171 -0.94786 1.726059
O  -2.558251 0.796982 1.681076
O  3.057695 0.563435 -1.057384
C  -4.534686 -1.003943 0.136748
C  -3.559455 -0.564254 -0.899963
C  -3.056866 -1.177706 0.416778
C  -5.272756 -2.296525 -0.127309
C  -5.375721 -0.003179 0.890954
C  -3.323087 0.861724 -1.232939
C  -2.281413 -0.324773 1.330716
C  -2.212561 1.323181 -1.813831
C  -2.059213 2.768256 -2.174587
C  -1.044739 0.44778 -2.156192
C  -0.228529 -0.195398 2.505407
C  0.570659 0.735481 1.637206
C  1.466399 0.19832 0.717347
C  0.412242 2.114066 1.719249
C  2.203567 1.040429 -0.102915
C  1.149355 2.946427 0.888537
C  2.049636 2.417986 -0.023365
C  3.844215 -0.52525 -0.798043
C  4.501758 -0.691672 0.415161
C  4.016755 -1.439353 -1.827742
C  5.329103 -1.791133 0.591163
C  4.857774 -2.527094 -1.641491
C  5.513081 -2.711578 -0.432179
H  -3.43091 -1.248549 -1.734408
H  -2.680443 -2.190636 0.33328
H  -4.657334 -3.016617 -0.66867
H  -6.167573 -2.111067 -0.725223
H  -5.589078 -2.765699 0.806574
H  -5.621467 -0.38196 1.884893
H  -6.317283 0.150419 0.35928
H  -4.909593 0.969273 1.016022
H  -4.123367 1.56309 -1.017357
H  -2.956062 3.347461 -1.95452
H  -1.832697 2.888022 -3.237677
H  -1.224129 3.217211 -1.629355
H  -1.052366 0.189015 -3.219389
H  -1.028124 -0.484699 -1.593098
H  -0.101409 0.966005 -1.972964
H  0.416609 -0.947432 2.958862
H  -0.730432 0.344388 3.309674
H  1.583424 -0.87725 0.645925
H  -0.285488 2.538264 2.429692
H  1.026191 4.019779 0.952916
H  2.627605 3.065656 -0.670647
H  4.37941 0.026828 1.216153
H  3.499576 -1.295502 -2.768292
H  5.840426 -1.920925 1.536385
H  4.992662 -3.237586 -2.446878
H  6.163406 -3.564199 -0.287777
elementType: O C H
totalener: -1117.86593792 hartree
nucrepener: 2306.78935071 hartree
electener: -3424.65528863 hartree
oneelecener: -6103.72869019 hartree
twoeener: 2679.07340156 hartree
cpcmener: -0.02499655 hartree
kineticenergy: 1112.81444241 hartree
xcener: -110.228755133389 hartree
chargesum: -0.0000000
charge: -0.290572 -0.461849 -0.335957 0.140322 -0.028586 -0.098618 -0.264637 -0.298391 -0.267051 0.373940 -0.003710 -0.215247 -0.295608 0.090928 0.014554 -0.213420 -0.172472 0.246693 -0.150299 -0.218882 0.274651 -0.187019 -0.247818 -0.147359 -0.121830 -0.184289 0.113009 0.093966 0.086034 0.093973 0.095359 0.100407 0.097037 0.093850 0.119504 0.087720 0.097849 0.087838 0.120415 0.095402 0.090906 0.125286 0.111087 0.139031 0.139188 0.155780 0.145023 0.154439 0.145423 0.158910 0.157503 0.157586
qa: -0.2906 -0.4618 -0.3360 0.1403 -0.0286 -0.0986 -0.2646 -0.2984 -0.2671 0.3739 -0.0037 -0.2152 -0.2956 0.0909 0.0146 -0.2134 -0.1725 0.2467 -0.1503 -0.2189 0.2747 -0.1870 -0.2478 -0.1474 -0.1218 -0.1843 0.1130 0.0940 0.0860 0.0940 0.0954 0.1004 0.0970 0.0939 0.1195 0.0877 0.0978 0.0878 0.1204 0.0954 0.0909 0.1253 0.1111 0.1390 0.1392 0.1558 0.1450 0.1544 0.1454 0.1589 0.1575 0.1576
va: 2.1092 2.0280 2.0440 3.7513 3.8105 3.8227 3.8980 3.8911 3.8502 4.1530 3.6828 3.9242 3.9559 3.8149 3.5960 3.8967 3.9005 3.6638 3.8987 3.9680 3.7114 3.9051 4.0062 3.8944 3.8864 3.9044 1.0039 1.0306 1.0044 1.0024 1.0025 1.0005 0.9987 1.0182 1.0030 1.0087 0.9953 0.9969 0.9983 1.0030 0.9975 0.9940 1.0105 1.0136 1.0128 0.9907 1.0055 0.9987 1.0087 0.9905 0.9894 0.9907
dispcorr: -0.027553089 hartree
energy: -1117.893491013973
dipole: -20.99817 21.43639 0.43822 -0.77738 -0.20263 -0.98001 -6.54823 6.50932 -0.03891
magnitude: 1.07423 au
magnitude: 2.73048 debye
