program: Orca
programVersion: 5.0.2
elementType: O O O C C C C C C C C C C C C C C C C C C C C C C C H H H H H H H H H H H H H H H H H H H H H H H H H H
charge: 0
multiplicity: 1
keywords: wb97x-d3
keywords: def2-TZVPP
keywords: def2/J RIJCOSX
keywords: DEFGRID2
keywords: scfconv7
keywords: smallprint printgap noloewdin
keywords: NOSOSCF
formula: C23H26O3
InChI: InChI=1/C23H26O3/c1-16(2)13-20-21(23(20,3)4)22(24)25-15-17-9-8-12-19(14-17)26-18-10-6-5-7-11-18/h5-14,20-21H,15H2,1-4H3
52 atoms
O  -1.321203 -1.741676 0.570703
O  -2.669038 -0.406407 1.752026
O  3.164706 0.842479 -0.670484
C  -4.674711 -0.671069 -0.597688
C  -3.746289 0.419916 -1.000437
C  -3.182633 -0.930384 -0.529671
C  -5.384305 -1.413822 -1.706162
C  -5.51313 -0.553244 0.651348
C  -3.56475 1.658723 -0.208132
C  -2.409816 -0.97877 0.720539
C  -2.456369 2.402976 -0.240431
C  -2.329944 3.655972 0.567935
C  -1.258101 2.009627 -1.058015
C  -0.337224 -1.722205 1.61298
C  0.518837 -0.492376 1.495466
C  1.474589 -0.428736 0.485747
C  0.331576 0.601832 2.333941
C  2.242826 0.71705 0.331981
C  1.094296 1.747679 2.16031
C  2.056277 1.811531 1.163909
C  4.035714 -0.17473 -0.943313
C  4.427237 -0.321801 -2.267523
C  4.565231 -0.995922 0.045662
C  5.356028 -1.295854 -2.602538
C  5.484201 -1.974247 -0.307419
C  5.883536 -2.131555 -1.627525
H  -3.617977 0.55004 -2.072844
H  -2.7843 -1.559693 -1.317031
H  -6.312871 -0.905641 -1.974684
H  -5.639352 -2.42952 -1.396803
H  -4.774098 -1.484526 -2.607686
H  -6.466957 -0.082077 0.404495
H  -5.054652 0.032638 1.442416
H  -5.734692 -1.541851 1.058447
H  -4.391459 1.97886 0.418626
H  -3.227238 3.862926 1.15149
H  -2.134598 4.521338 -0.071159
H  -1.48555 3.588471 1.260063
H  -1.522183 1.784219 -2.09352
H  -0.775055 1.114119 -0.657286
H  -0.506418 2.798854 -1.07653
H  0.253645 -2.623158 1.452742
H  -0.802329 -1.795968 2.596815
H  1.615598 -1.275662 -0.176639
H  -0.408173 0.560748 3.122363
H  0.948096 2.597435 2.81438
H  2.6591 2.701107 1.031233
H  4.010589 0.327797 -3.027281
H  4.275385 -0.87828 1.082254
H  5.661359 -1.40472 -3.63532
H  5.894265 -2.614197 0.463469
H  6.602277 -2.895574 -1.892778
elementType: O C H
totalener: -1117.86463483 hartree
nucrepener: 2294.31773831 hartree
electener: -3412.18237314 hartree
oneelecener: -6078.62952927 hartree
twoeener: 2666.44715612 hartree
cpcmener: -0.02458343 hartree
kineticenergy: 1112.80681040 hartree
xcener: -110.227563995794 hartree
chargesum: 0.0000000
charge: -0.290147 -0.462010 -0.332590 0.128855 -0.022341 -0.089932 -0.264697 -0.298734 -0.254761 0.370027 -0.010429 -0.217738 -0.287358 0.077266 -0.005098 -0.186909 -0.167364 0.251749 -0.153823 -0.222759 0.290421 -0.255621 -0.189969 -0.120279 -0.150575 -0.188531 0.111122 0.090390 0.093925 0.095396 0.085556 0.098261 0.095054 0.099809 0.121137 0.086973 0.098397 0.091711 0.111357 0.078117 0.104020 0.122682 0.113016 0.141305 0.139158 0.157440 0.145533 0.145282 0.153654 0.157317 0.159378 0.157350
qa: -0.2901 -0.4620 -0.3326 0.1289 -0.0223 -0.0899 -0.2647 -0.2987 -0.2548 0.3700 -0.0104 -0.2177 -0.2874 0.0773 -0.0051 -0.1869 -0.1674 0.2517 -0.1538 -0.2228 0.2904 -0.2556 -0.1900 -0.1203 -0.1506 -0.1885 0.1111 0.0904 0.0939 0.0954 0.0856 0.0983 0.0951 0.0998 0.1211 0.0870 0.0984 0.0917 0.1114 0.0781 0.1040 0.1227 0.1130 0.1413 0.1392 0.1574 0.1455 0.1453 0.1537 0.1573 0.1594 0.1574
va: 2.1049 2.0244 2.0655 3.7612 3.8182 3.8271 3.8975 3.8917 3.8113 4.1386 3.6660 3.9194 3.9676 3.8283 3.5986 3.8996 3.8630 3.7139 3.8865 3.9671 3.6965 4.0057 3.8941 3.8880 3.8978 3.9063 1.0068 1.0324 1.0024 1.0024 1.0049 0.9984 1.0180 1.0005 1.0005 1.0089 0.9953 0.9949 1.0038 0.9997 1.0027 0.9950 1.0112 1.0091 1.0164 0.9904 1.0058 1.0093 0.9993 0.9892 0.9904 0.9907
dispcorr: -0.027778377 hartree
energy: -1117.892413205248
dipole: -21.86399 22.28825 0.42427 4.92614 -5.52322 -0.59708 -3.75844 3.20525 -0.55319
magnitude: 0.91789 au
magnitude: 2.33310 debye
