program: Orca
programVersion: 5.0.2
elementType: O O O C C C C C C C C C C C C C C C C C C C C C C C H H H H H H H H H H H H H H H H H H H H H H H H H H
charge: 0
multiplicity: 1
keywords: wb97x-d3
keywords: def2-TZVPP
keywords: def2/J RIJCOSX
keywords: DEFGRID2
keywords: scfconv7
keywords: smallprint printgap noloewdin
keywords: NOSOSCF
formula: C23H26O3
InChI: InChI=1/C23H26O3/c1-16(2)13-20-21(23(20,3)4)22(24)25-15-17-9-8-12-19(14-17)26-18-10-6-5-7-11-18/h5-14,20-21H,15H2,1-4H3
52 atoms
O  -2.282254 1.117745 -0.980031
O  -2.333786 2.193949 0.969337
O  2.667815 -0.052171 -0.855629
C  -4.319652 -0.827568 0.239071
C  -2.96758 -1.419427 0.452002
C  -3.244742 0.02535 0.887357
C  -5.419195 -1.271361 1.176498
C  -4.829845 -0.537219 -1.150981
C  -2.071517 -1.808874 -0.660934
C  -2.588059 1.210511 0.310993
C  -0.816648 -2.235176 -0.490104
C  -0.000009 -2.746568 -1.636411
C  -0.148716 -2.247187 0.856474
C  -1.564915 2.207987 -1.562392
C  -0.132566 2.245006 -1.109621
C  0.625285 1.077811 -1.126477
C  0.452492 3.43293 -0.692991
C  1.954955 1.111469 -0.74559
C  1.790566 3.456415 -0.319875
C  2.553559 2.30018 -0.344519
C  3.397539 -0.531192 0.192499
C  4.419987 -1.416173 -0.13067
C  3.12727 -0.219425 1.519644
C  5.175994 -1.987638 0.880283
C  3.90271 -0.791718 2.519831
C  4.926887 -1.675015 2.210458
H  -2.887519 -2.070221 1.318928
H  -3.364405 0.151115 1.957339
H  -5.893148 -2.182446 0.804871
H  -6.194549 -0.507532 1.265204
H  -5.042382 -1.480675 2.178542
H  -5.559387 0.274543 -1.126653
H  -5.339531 -1.420188 -1.542623
H  -4.060333 -0.264244 -1.867208
H  -2.487131 -1.812036 -1.663514
H  0.926829 -2.178886 -1.749965
H  -0.542268 -2.704539 -2.581214
H  0.299042 -3.78509 -1.46644
H  0.93226 -2.354701 0.763093
H  -0.495644 -3.083947 1.469802
H  -0.343198 -1.334278 1.421993
H  -2.065753 3.157131 -1.362441
H  -1.618865 2.026084 -2.63604
H  0.187195 0.139304 -1.44469
H  -0.133928 4.342864 -0.660994
H  2.245381 4.386077 -0.003225
H  3.597929 2.325531 -0.059665
H  4.614216 -1.656161 -1.168893
H  2.322937 0.4552 1.78365
H  5.968583 -2.678629 0.623038
H  3.694013 -0.543883 3.552715
H  5.523618 -2.117444 2.997097
elementType: O C H
totalener: -1117.86318996 hartree
nucrepener: 2343.50180916 hartree
electener: -3461.36499912 hartree
oneelecener: -6176.71040189 hartree
twoeener: 2715.34540277 hartree
cpcmener: -0.02529369 hartree
kineticenergy: 1112.80861877 hartree
xcener: -110.230148903002 hartree
chargesum: 0.0000000
charge: -0.271712 -0.469896 -0.325648 0.140042 -0.031795 -0.125197 -0.263734 -0.291509 -0.240327 0.402674 -0.057547 -0.213777 -0.295595 0.065059 0.031418 -0.256783 -0.187118 0.243258 -0.128208 -0.192314 0.329620 -0.273394 -0.234048 -0.107653 -0.132062 -0.201463 0.111105 0.091360 0.093978 0.095145 0.086614 0.102868 0.099911 0.090351 0.122114 0.079338 0.090848 0.110441 0.091123 0.120043 0.101762 0.116173 0.115846 0.146567 0.141468 0.157813 0.155698 0.143220 0.151549 0.156824 0.158313 0.157241
qa: -0.2717 -0.4699 -0.3256 0.1400 -0.0318 -0.1252 -0.2637 -0.2915 -0.2403 0.4027 -0.0575 -0.2138 -0.2956 0.0651 0.0314 -0.2568 -0.1871 0.2433 -0.1282 -0.1923 0.3296 -0.2734 -0.2340 -0.1077 -0.1321 -0.2015 0.1111 0.0914 0.0940 0.0951 0.0866 0.1029 0.0999 0.0904 0.1221 0.0793 0.0908 0.1104 0.0911 0.1200 0.1018 0.1162 0.1158 0.1466 0.1415 0.1578 0.1557 0.1432 0.1515 0.1568 0.1583 0.1572
va: 2.1065 2.0381 2.0419 3.7616 3.7615 3.8699 3.8981 3.9029 3.7766 4.1482 3.7182 3.8893 3.9411 3.8184 3.6609 3.9953 3.9402 3.7749 3.8973 3.9458 3.5792 4.0171 3.8913 3.8759 3.8978 3.9170 1.0022 1.0302 1.0020 1.0022 1.0056 1.0003 0.9989 1.0128 1.0041 1.0086 1.0094 0.9935 1.0043 0.9991 0.9967 1.0083 0.9959 1.0055 1.0030 0.9898 0.9956 1.0102 1.0043 0.9891 0.9897 0.9910
dispcorr: -0.029052915 hartree
energy: -1117.892242870456
dipole: -15.03267 14.92880 -0.10386 -14.31765 13.61311 -0.70454 0.58286 -0.93260 -0.34974
magnitude: 0.79340 au
magnitude: 2.01666 debye
