program: Orca
programVersion: 5.0.2
elementType: O O O C C C C C C C C C C C C C C C C C C C C C C C H H H H H H H H H H H H H H H H H H H H H H H H H H
charge: 0
multiplicity: 1
keywords: wb97x-d3
keywords: def2-TZVPP
keywords: def2/J RIJCOSX
keywords: DEFGRID2
keywords: scfconv7
keywords: smallprint printgap noloewdin
keywords: NOSOSCF
formula: C23H26O3
InChI: InChI=1/C23H26O3/c1-16(2)13-20-21(23(20,3)4)22(24)25-15-17-9-8-12-19(14-17)26-18-10-6-5-7-11-18/h5-14,20-21H,15H2,1-4H3
52 atoms
O  -1.851146 0.178243 -1.318344
O  -2.903027 2.142744 -1.225352
O  2.975096 0.578685 0.988691
C  -4.350786 -1.10538 -0.161964
C  -3.547255 -0.691287 1.022262
C  -3.858295 0.328651 -0.075255
C  -5.841072 -1.261143 0.038946
C  -3.801845 -2.080223 -1.175303
C  -2.187099 -1.213707 1.306151
C  -2.837649 0.971667 -0.921996
C  -1.268625 -0.579939 2.039312
C  0.040037 -1.221986 2.383955
C  -1.453385 0.810666 2.564367
C  -0.806429 0.738796 -2.12638
C  0.227987 1.433032 -1.286892
C  1.132708 0.668616 -0.55681
C  0.285813 2.8212 -1.213676
C  2.092053 1.294856 0.226685
C  1.240961 3.435388 -0.416781
C  2.150807 2.678414 0.305652
C  3.633607 -0.485115 0.434881
C  4.1496 -0.439329 -0.855023
C  3.821907 -1.605008 1.233042
C  4.856049 -1.529798 -1.341184
C  4.538354 -2.684605 0.735817
C  5.054688 -2.655038 -0.552228
H  -4.131141 -0.489796 1.917478
H  -4.623134 1.048106 0.19379
H  -6.382804 -1.105905 -0.896429
H  -6.231598 -0.551665 0.769995
H  -6.076761 -2.265967 0.396094
H  -4.197522 -1.866851 -2.170195
H  -4.119646 -3.090996 -0.910753
H  -2.718038 -2.091915 -1.244936
H  -1.955873 -2.209056 0.937159
H  0.088927 -1.445545 3.453742
H  0.876367 -0.552547 2.176645
H  0.204298 -2.152761 1.840541
H  -1.129608 0.885676 3.605211
H  -2.482344 1.161996 2.506473
H  -0.832596 1.512977 1.998922
H  -1.217715 1.406931 -2.883845
H  -0.370385 -0.118586 -2.63731
H  1.090237 -0.413898 -0.607705
H  -0.411438 3.423384 -1.781169
H  1.285008 4.515365 -0.362407
H  2.903476 3.154299 0.921667
H  4.011545 0.436663 -1.476526
H  3.414889 -1.627885 2.236501
H  5.259688 -1.492518 -2.344913
H  4.68568 -3.556048 1.360771
H  5.60942 -3.500318 -0.93777
elementType: O C H
totalener: -1117.86330203 hartree
nucrepener: 2339.19328584 hartree
electener: -3457.05658787 hartree
oneelecener: -6168.01942359 hartree
twoeener: 2710.96283573 hartree
cpcmener: -0.02495890 hartree
kineticenergy: 1112.80855284 hartree
xcener: -110.228189824782 hartree
chargesum: -0.0000000
charge: -0.263386 -0.479290 -0.340816 0.151181 -0.031724 -0.155261 -0.268535 -0.294829 -0.254527 0.428666 -0.016771 -0.243283 -0.257424 0.056205 0.000460 -0.189552 -0.161485 0.244483 -0.140423 -0.232658 0.259841 -0.166245 -0.240072 -0.160596 -0.129615 -0.178229 0.109300 0.091638 0.095233 0.085863 0.093244 0.103697 0.096434 0.090501 0.121020 0.110590 0.073748 0.095907 0.106430 0.095853 0.088287 0.118577 0.116908 0.145925 0.139859 0.156511 0.147542 0.154126 0.153155 0.158301 0.157283 0.157953
qa: -0.2634 -0.4793 -0.3408 0.1512 -0.0317 -0.1553 -0.2685 -0.2948 -0.2545 0.4287 -0.0168 -0.2433 -0.2574 0.0562 0.0005 -0.1896 -0.1615 0.2445 -0.1404 -0.2327 0.2598 -0.1662 -0.2401 -0.1606 -0.1296 -0.1782 0.1093 0.0916 0.0952 0.0859 0.0932 0.1037 0.0964 0.0905 0.1210 0.1106 0.0737 0.0959 0.1064 0.0959 0.0883 0.1186 0.1169 0.1459 0.1399 0.1565 0.1475 0.1541 0.1532 0.1583 0.1573 0.1580
va: 2.1143 2.0278 2.0291 3.7138 3.8068 3.8571 3.9055 3.9025 3.8300 4.1329 3.7031 3.9173 3.9504 3.8319 3.6257 3.8875 3.9219 3.6599 3.9343 4.0256 3.7213 3.8922 3.9666 3.9060 3.9059 3.9016 1.0053 1.0296 1.0019 1.0055 1.0020 1.0006 0.9991 1.0107 1.0011 0.9986 1.0061 1.0056 1.0003 1.0059 0.9988 1.0091 0.9993 1.0069 1.0156 0.9901 1.0051 0.9980 1.0016 0.9910 0.9901 0.9902
dispcorr: -0.029343788 hartree
energy: -1117.892645819897
dipole: -15.92765 16.27471 0.34707 -10.74138 9.51539 -1.22599 5.62569 -5.78896 -0.16327
magnitude: 1.28459 au
magnitude: 3.26517 debye
