program: Orca
programVersion: 5.0.2
elementType: O O O C C C C C C C C C C C C C C C C C C C C C C C H H H H H H H H H H H H H H H H H H H H H H H H H H
charge: 0
multiplicity: 1
keywords: wb97x-d3
keywords: def2-TZVPP
keywords: def2/J RIJCOSX
keywords: DEFGRID2
keywords: scfconv7
keywords: smallprint printgap noloewdin
keywords: NOSOSCF
formula: C23H26O3
InChI: InChI=1/C23H26O3/c1-16(2)13-20-21(23(20,3)4)22(24)25-15-17-9-8-12-19(14-17)26-18-10-6-5-7-11-18/h5-14,20-21H,15H2,1-4H3
52 atoms
O  -1.716899 1.742938 -0.567242
O  -1.105486 0.668596 1.297303
O  2.990183 0.521814 -1.994786
C  -1.971025 -1.819077 -0.46504
C  -3.084836 -1.55094 0.486629
C  -2.51498 -0.402317 -0.333137
C  -2.297492 -2.50924 -1.767354
C  -0.594685 -2.153777 0.051786
C  -2.924263 -1.68573 1.957317
C  -1.710647 0.681684 0.253544
C  -3.565005 -0.961984 2.877156
C  -3.386199 -1.228378 4.340577
C  -4.486104 0.169809 2.543109
C  -0.959556 2.888756 -0.210126
C  0.476572 2.818729 -0.659996
C  1.063949 1.65151 -1.124962
C  1.235276 3.987733 -0.60294
C  2.402319 1.657165 -1.502864
C  2.560579 3.983423 -1.001079
C  3.1605 2.812739 -1.447412
C  2.951512 -0.628036 -1.256557
C  2.950806 -1.825539 -1.961122
C  2.964243 -0.627271 0.133693
C  2.971838 -3.027166 -1.268608
C  2.976924 -1.838307 0.811771
C  2.981803 -3.041438 0.119744
H  -4.068477 -1.839817 0.122817
H  -3.131369 -0.078153 -1.163755
H  -1.587968 -2.229413 -2.548729
H  -3.298362 -2.259551 -2.122235
H  -2.248311 -3.593913 -1.649726
H  0.169066 -1.837373 -0.661562
H  -0.500083 -3.235241 0.169443
H  -0.3630 -1.700468 1.01214
H  -2.265949 -2.480542 2.297734
H  -4.340352 -1.471764 4.815943
H  -3.001898 -0.344623 4.856991
H  -2.698289 -2.052987 4.52822
H  -4.121161 1.103327 2.980356
H  -5.479311 0.000888 2.96797
H  -4.605907 0.327519 1.472584
H  -1.007367 3.070207 0.866405
H  -1.456382 3.726897 -0.699772
H  0.502888 0.72977 -1.21553
H  0.781763 4.906808 -0.250696
H  3.139212 4.897046 -0.959007
H  4.198818 2.799797 -1.753402
H  2.939631 -1.813192 -3.043996
H  2.970392 0.300756 0.691251
H  2.972386 -3.957496 -1.822073
H  2.986243 -1.834924 1.894239
H  2.991177 -3.980395 0.657376
elementType: O C H
totalener: -1117.86618578 hartree
nucrepener: 2341.30049223 hartree
electener: -3459.16667801 hartree
oneelecener: -6172.76443516 hartree
twoeener: 2713.59775715 hartree
cpcmener: -0.02625784 hartree
kineticenergy: 1112.79709049 hartree
xcener: -110.229619555818 hartree
chargesum: 0.0000000
charge: -0.292907 -0.449532 -0.331089 0.171315 -0.017515 -0.098350 -0.267189 -0.314925 -0.274364 0.345902 -0.023191 -0.225804 -0.265664 0.083241 0.018504 -0.180133 -0.218626 0.221971 -0.126631 -0.220920 0.261223 -0.215347 -0.165716 -0.135299 -0.168459 -0.177383 0.115692 0.095869 0.095857 0.087854 0.093773 0.063486 0.109312 0.105068 0.121692 0.094585 0.093731 0.088544 0.097982 0.105751 0.092332 0.115995 0.125740 0.158240 0.141409 0.156767 0.146080 0.142960 0.150355 0.154890 0.157447 0.155479
qa: -0.2929 -0.4495 -0.3311 0.1713 -0.0175 -0.0983 -0.2672 -0.3149 -0.2744 0.3459 -0.0232 -0.2258 -0.2657 0.0832 0.0185 -0.1801 -0.2186 0.2220 -0.1266 -0.2209 0.2612 -0.2153 -0.1657 -0.1353 -0.1685 -0.1774 0.1157 0.0959 0.0959 0.0879 0.0938 0.0635 0.1093 0.1051 0.1217 0.0946 0.0937 0.0885 0.0980 0.1058 0.0923 0.1160 0.1257 0.1582 0.1414 0.1568 0.1461 0.1430 0.1504 0.1549 0.1574 0.1555
va: 2.1117 2.0295 2.0717 3.7298 3.8595 3.8281 3.8985 3.8971 3.8559 4.1330 3.7077 3.9270 3.9427 3.8478 3.6636 3.9390 3.9617 3.7901 3.8870 3.9950 3.6978 3.9511 3.8382 3.8828 3.8640 3.8543 1.0019 1.0306 1.0012 1.0055 1.0021 1.0136 1.0001 1.0087 1.0009 0.9964 0.9968 1.0074 0.9985 0.9995 1.0060 1.0117 0.9924 0.9856 1.0005 0.9895 1.0051 1.0089 1.0014 0.9902 0.9923 0.9916
dispcorr: -0.028330676 hartree
energy: -1117.894516458594
dipole: -19.00237 18.14767 -0.85470 -12.16123 12.32362 0.16239 11.34513 -11.55127 -0.20614
magnitude: 0.89408 au
magnitude: 2.27257 debye
