program: Orca
programVersion: 5.0.2
elementType: O O O C C C C C C C C C C C C C C C C C C C C C C C H H H H H H H H H H H H H H H H H H H H H H H H H H
charge: 0
multiplicity: 1
keywords: wb97x-d3
keywords: def2-TZVPP
keywords: def2/J RIJCOSX
keywords: DEFGRID2
keywords: scfconv7
keywords: smallprint printgap noloewdin
keywords: NOSOSCF
formula: C23H26O3
InChI: InChI=1/C23H26O3/c1-16(2)13-20-21(23(20,3)4)22(24)25-15-17-9-8-12-19(14-17)26-18-10-6-5-7-11-18/h5-14,20-21H,15H2,1-4H3
52 atoms
O  -1.312992 1.177162 -1.337505
O  -1.355101 1.317942 0.887531
O  3.796031 0.755826 -1.373829
C  -1.605465 -1.79201 0.791144
C  -3.029577 -1.336558 0.712875
C  -1.980694 -0.726042 -0.220763
C  -1.282311 -3.139834 0.190134
C  -0.75637 -1.473191 1.997008
C  -3.695092 -0.572755 1.783818
C  -1.528118 0.671483 -0.117648
C  -4.960116 -0.733206 2.191481
C  -5.50611 0.097803 3.314818
C  -5.944186 -1.707628 1.618014
C  -0.797428 2.503158 -1.418747
C  0.646767 2.591386 -1.008637
C  1.539461 1.582036 -1.35194
C  1.107688 3.718162 -0.336604
C  2.880272 1.707207 -1.014571
C  2.453815 3.839914 -0.024623
C  3.348667 2.833542 -0.354035
C  3.507984 -0.564895 -1.156188
C  2.98724 -1.008393 0.05391
C  3.810162 -1.463325 -2.169401
C  2.773395 -2.366317 0.24168
C  3.59482 -2.81931 -1.965695
C  3.073969 -3.276737 -0.763418
H  -3.68028 -2.014818 0.173066
H  -2.045303 -1.075827 -1.244502
H  -1.424399 -3.93354 0.926611
H  -0.243195 -3.178969 -0.144628
H  -1.915899 -3.367604 -0.668235
H  -1.02924 -0.556222 2.510359
H  0.295702 -1.393823 1.716431
H  -0.839659 -2.287521 2.719651
H  -3.104549 0.17654 2.296968
H  -6.393137 0.653903 2.999072
H  -4.777204 0.814969 3.692361
H  -5.821244 -0.532419 4.151164
H  -6.79641 -1.179425 1.182338
H  -6.351901 -2.346926 2.405208
H  -5.533585 -2.358613 0.849399
H  -1.408592 3.197863 -0.838709
H  -0.905343 2.773355 -2.470076
H  1.197247 0.704163 -1.887913
H  0.414361 4.502151 -0.057994
H  2.809177 4.718882 0.497439
H  4.398185 2.917793 -0.10178
H  2.760487 -0.30783 0.84836
H  4.214215 -1.103107 -3.107253
H  2.376611 -2.713721 1.186995
H  3.831089 -3.5191 -2.756913
H  2.906977 -4.334495 -0.607846
elementType: O C H
totalener: -1117.86703414 hartree
nucrepener: 2290.05247468 hartree
electener: -3407.91950882 hartree
oneelecener: -6069.97129717 hartree
twoeener: 2662.05178835 hartree
cpcmener: -0.02553150 hartree
kineticenergy: 1112.80023908 hartree
xcener: -110.228145293600 hartree
chargesum: 0.0000000
charge: -0.297676 -0.464430 -0.335232 0.114972 0.021706 -0.069722 -0.258981 -0.280506 -0.293258 0.383687 -0.059772 -0.217931 -0.256729 0.106003 0.027714 -0.192624 -0.219309 0.223052 -0.118427 -0.237036 0.246257 -0.145515 -0.229020 -0.196462 -0.127979 -0.166587 0.116542 0.094606 0.094859 0.086262 0.088163 0.101047 0.081963 0.100714 0.120070 0.091890 0.088184 0.092759 0.097757 0.094368 0.088699 0.112471 0.120073 0.141000 0.140988 0.157037 0.147104 0.157892 0.145581 0.167810 0.157277 0.158687
qa: -0.2977 -0.4644 -0.3352 0.1150 0.0217 -0.0697 -0.2590 -0.2805 -0.2933 0.3837 -0.0598 -0.2179 -0.2567 0.1060 0.0277 -0.1926 -0.2193 0.2231 -0.1184 -0.2370 0.2463 -0.1455 -0.2290 -0.1965 -0.1280 -0.1666 0.1165 0.0946 0.0949 0.0863 0.0882 0.1010 0.0820 0.1007 0.1201 0.0919 0.0882 0.0928 0.0978 0.0944 0.0887 0.1125 0.1201 0.1410 0.1410 0.1570 0.1471 0.1579 0.1456 0.1678 0.1573 0.1587
va: 2.1125 2.0299 2.0609 3.6849 3.7693 3.8341 3.9136 3.9057 3.8575 4.1073 3.7920 3.9223 3.9391 3.8022 3.6265 3.9096 3.9675 3.7593 3.8964 4.0107 3.7337 3.8475 3.9969 3.8735 3.8961 3.8716 1.0025 1.0303 1.0017 1.0050 1.0068 1.0174 1.0093 1.0012 1.0249 0.9962 1.0094 0.9965 0.9964 0.9973 1.0140 1.0117 0.9916 1.0190 1.0033 0.9891 1.0055 0.9976 1.0074 0.9832 0.9887 0.9902
dispcorr: -0.026000531 hartree
energy: -1117.893034673157
dipole: -25.26683 24.50490 -0.76193 -14.36570 13.55748 -0.80822 13.56074 -14.02862 -0.46788
magnitude: 1.20527 au
magnitude: 3.06355 debye
