program: Orca
programVersion: 5.0.2
elementType: O O O C C C C C C C C C C C C C C C C C C C C C C C H H H H H H H H H H H H H H H H H H H H H H H H H H
charge: 0
multiplicity: 1
keywords: wb97x-d3
keywords: def2-TZVPP
keywords: def2/J RIJCOSX
keywords: DEFGRID2
keywords: scfconv7
keywords: smallprint printgap noloewdin
keywords: NOSOSCF
formula: C23H26O3
InChI: InChI=1/C23H26O3/c1-16(2)13-20-21(23(20,3)4)22(24)25-15-17-9-8-12-19(14-17)26-18-10-6-5-7-11-18/h5-14,20-21H,15H2,1-4H3
52 atoms
O  -1.230959 1.100378 -1.287005
O  -1.464297 1.082936 0.932425
O  3.888276 0.594975 -0.787997
C  -1.890522 -1.992723 0.555522
C  -3.245834 -1.379974 0.525696
C  -2.142853 -0.81474 -0.372611
C  -1.7075 -3.316232 -0.149546
C  -1.006111 -1.852183 1.768663
C  -3.809681 -0.614132 1.664554
C  -1.589713 0.526179 -0.131581
C  -4.750185 0.326066 1.544669
C  -5.290307 1.05477 2.736033
C  -5.290114 0.764732 0.216359
C  -0.66018 2.406029 -1.216354
C  0.71073 2.411836 -0.598479
C  1.649235 1.457778 -0.976004
C  1.059076 3.394038 0.321399
C  2.91999 1.486977 -0.418463
C  2.341038 3.428673 0.85021
C  3.276776 2.47044 0.493193
C  3.592239 -0.734178 -0.908311
C  4.23698 -1.432262 -1.920591
C  2.736447 -1.389397 -0.030253
C  4.026298 -2.797215 -2.050896
C  2.529092 -2.753357 -0.178854
C  3.168673 -3.46332 -1.186337
H  -3.984256 -1.928829 -0.054273
H  -2.225457 -1.070435 -1.422513
H  -0.677477 -3.437847 -0.492015
H  -2.359407 -3.410635 -1.019049
H  -1.933226 -4.145155 0.524711
H  0.046213 -1.909017 1.482042
H  -1.200711 -2.675865 2.458758
H  -1.147221 -0.925801 2.318099
H  -3.438495 -0.853517 2.656684
H  -6.367497 0.898832 2.839628
H  -5.144645 2.133609 2.631892
H  -4.81299 0.740294 3.664298
H  -5.21529 -0.00581 -0.550838
H  -4.745531 1.641203 -0.149368
H  -6.338964 1.058893 0.292066
H  -1.325472 3.09177 -0.686899
H  -0.609069 2.736232 -2.254507
H  1.392895 0.696968 -1.704325
H  0.32751 4.132348 0.62564
H  2.609917 4.195737 1.564844
H  4.273796 2.482919 0.915174
H  4.902583 -0.909262 -2.596109
H  2.240331 -0.851118 0.767837
H  4.532013 -3.338875 -2.83991
H  1.866902 -3.264304 0.508686
H  3.003121 -4.527245 -1.29317
elementType: O C H
totalener: -1117.86563756 hartree
nucrepener: 2314.91590045 hartree
electener: -3432.78153801 hartree
oneelecener: -6119.79970432 hartree
twoeener: 2687.01816630 hartree
cpcmener: -0.02675195 hartree
kineticenergy: 1112.80580031 hartree
xcener: -110.227981261507 hartree
chargesum: -0.0000000
charge: -0.300912 -0.460534 -0.331748 0.136826 -0.031479 -0.076405 -0.262955 -0.291617 -0.260130 0.375713 -0.020196 -0.223963 -0.278262 0.103269 0.039770 -0.230595 -0.219067 0.256938 -0.115923 -0.246962 0.276604 -0.251075 -0.173173 -0.117679 -0.159038 -0.193869 0.111477 0.090469 0.090391 0.087375 0.095010 0.076126 0.104195 0.098507 0.121394 0.093744 0.095649 0.087752 0.097262 0.103024 0.102608 0.112783 0.121414 0.139981 0.140561 0.156517 0.146849 0.145115 0.157426 0.157073 0.166948 0.156813
qa: -0.3009 -0.4605 -0.3317 0.1368 -0.0315 -0.0764 -0.2630 -0.2916 -0.2601 0.3757 -0.0202 -0.2240 -0.2783 0.1033 0.0398 -0.2306 -0.2191 0.2569 -0.1159 -0.2470 0.2766 -0.2511 -0.1732 -0.1177 -0.1590 -0.1939 0.1115 0.0905 0.0904 0.0874 0.0950 0.0761 0.1042 0.0985 0.1214 0.0937 0.0956 0.0878 0.0973 0.1030 0.1026 0.1128 0.1214 0.1400 0.1406 0.1565 0.1468 0.1451 0.1574 0.1571 0.1669 0.1568
va: 2.1042 2.0265 2.0735 3.7368 3.8396 3.8277 3.9024 3.9005 3.8398 4.0919 3.7155 3.9303 3.9497 3.8090 3.6149 3.9341 3.9636 3.7317 3.8948 4.0141 3.7289 4.0083 3.8764 3.8905 3.8730 3.9275 1.0035 1.0318 1.0045 1.0062 1.0014 1.0128 0.9996 1.0191 1.0006 0.9965 0.9949 1.0076 1.0015 0.9962 1.0017 1.0081 0.9917 1.0174 1.0040 0.9895 1.0058 1.0084 0.9964 0.9886 0.9835 0.9922
dispcorr: -0.026981823 hartree
energy: -1117.892619385807
dipole: -24.88844 24.13829 -0.75015 -8.90024 8.42655 -0.47369 7.91290 -8.62179 -0.70888
magnitude: 1.13562 au
magnitude: 2.88651 debye
