program: Orca
programVersion: 5.0.2
elementType: O O O C C C C C C C C C C C C C C C C C C C C C C C H H H H H H H H H H H H H H H H H H H H H H H H H H
charge: 0
multiplicity: 1
keywords: wb97x-d3
keywords: def2-TZVPP
keywords: def2/J RIJCOSX
keywords: DEFGRID2
keywords: scfconv7
keywords: smallprint printgap noloewdin
keywords: NOSOSCF
formula: C23H26O3
InChI: InChI=1/C23H26O3/c1-16(2)13-20-21(23(20,3)4)22(24)25-15-17-9-8-12-19(14-17)26-18-10-6-5-7-11-18/h5-14,20-21H,15H2,1-4H3
52 atoms
O  -1.706951 2.198241 0.425089
O  -0.765168 0.196648 0.729148
O  3.52217 0.796919 -1.681096
C  -3.517836 -0.724534 -0.539956
C  -3.55585 -0.999735 0.922565
C  -3.138993 0.384011 0.433863
C  -4.834292 -0.524094 -1.252397
C  -2.466523 -1.364999 -1.412065
C  -2.623978 -1.941751 1.587619
C  -1.753457 0.867041 0.550392
C  -2.338975 -1.909877 2.8910
C  -1.40996 -2.904458 3.514587
C  -2.88459 -0.841701 3.795781
C  -0.416185 2.817471 0.439482
C  0.386667 2.465546 -0.781509
C  1.603416 1.813368 -0.64672
C  -0.096293 2.767314 -2.052539
C  2.317449 1.43807 -1.776826
C  0.636109 2.408538 -3.173446
C  1.84127 1.731514 -3.044777
C  3.66723 -0.257891 -0.822723
C  2.630931 -1.136369 -0.525078
C  4.932599 -0.4518 -0.283739
C  2.872803 -2.205115 0.326431
C  5.160793 -1.531392 0.556551
C  4.132766 -2.409209 0.87225
H  -4.549579 -0.975007 1.365388
H  -3.883209 1.164853 0.542331
H  -4.713902 0.11563 -2.129053
H  -5.582866 -0.064328 -0.605529
H  -5.235494 -1.480943 -1.59347
H  -2.271706 -0.747173 -2.291194
H  -2.823709 -2.333861 -1.767531
H  -1.515746 -1.532944 -0.912223
H  -2.175231 -2.71687 0.973581
H  -1.028839 -3.623012 2.788524
H  -1.904265 -3.461468 4.315094
H  -0.552211 -2.403556 3.972283
H  -3.95133 -0.669392 3.641317
H  -2.381523 0.113926 3.6210
H  -2.740879 -1.091405 4.847387
H  0.124327 2.561218 1.353109
H  -0.630273 3.885653 0.469104
H  1.979952 1.57971 0.34218
H  -1.042248 3.282131 -2.169158
H  0.262152 2.644417 -4.16135
H  2.406203 1.433954 -3.919276
H  1.642817 -1.000083 -0.946198
H  5.732129 0.237407 -0.525668
H  2.062801 -2.884147 0.560427
H  6.148994 -1.678506 0.973254
H  4.31185 -3.244899 1.53578
elementType: O C H
totalener: -1117.86455293 hartree
nucrepener: 2309.43007266 hartree
electener: -3427.29462559 hartree
oneelecener: -6109.29327040 hartree
twoeener: 2681.99864481 hartree
cpcmener: -0.02556110 hartree
kineticenergy: 1112.80641698 hartree
xcener: -110.226692253359 hartree
chargesum: 0.0000000
charge: -0.292319 -0.462087 -0.332554 0.127307 -0.034497 -0.090523 -0.264365 -0.289415 -0.236769 0.377547 -0.032395 -0.226151 -0.274034 0.087809 0.035108 -0.198718 -0.253951 0.266515 -0.111473 -0.242978 0.292871 -0.189669 -0.249348 -0.153129 -0.122114 -0.189430 0.113183 0.091476 0.095381 0.086109 0.093650 0.098557 0.103521 0.084816 0.122394 0.084870 0.095146 0.098477 0.097400 0.100104 0.098631 0.113779 0.125213 0.140742 0.141027 0.157401 0.146940 0.154167 0.144398 0.158064 0.157010 0.156308
qa: -0.2923 -0.4621 -0.3326 0.1273 -0.0345 -0.0905 -0.2644 -0.2894 -0.2368 0.3775 -0.0324 -0.2262 -0.2740 0.0878 0.0351 -0.1987 -0.2540 0.2665 -0.1115 -0.2430 0.2929 -0.1897 -0.2493 -0.1531 -0.1221 -0.1894 0.1132 0.0915 0.0954 0.0861 0.0936 0.0986 0.1035 0.0848 0.1224 0.0849 0.0951 0.0985 0.0974 0.1001 0.0986 0.1138 0.1252 0.1407 0.1410 0.1574 0.1469 0.1542 0.1444 0.1581 0.1570 0.1563
va: 2.1128 2.0227 2.0769 3.7736 3.8353 3.8251 3.8981 3.9116 3.8067 4.1220 3.7129 3.9261 3.9510 3.8174 3.5765 3.9240 3.9595 3.7282 3.8776 4.0225 3.7002 3.8829 3.9979 3.9022 3.8881 3.9097 1.0027 1.0318 1.0022 1.0052 1.0021 1.0023 0.9993 1.0106 0.9980 1.0086 0.9953 0.9936 0.9985 0.9969 1.0048 1.0081 0.9916 1.0103 1.0096 0.9888 1.0055 0.9968 1.0089 0.9909 0.9889 0.9910
dispcorr: -0.026174988 hartree
energy: -1117.890727921584
dipole: -21.47911 20.26340 -1.21571 -12.59732 12.96463 0.36732 9.85477 -9.66268 0.19209
magnitude: 1.28443 au
magnitude: 3.26477 debye
