program: Orca
programVersion: 5.0.2
elementType: O O O C C C C C C C C C C C C C C C C C C C C C C C H H H H H H H H H H H H H H H H H H H H H H H H H H
charge: 0
multiplicity: 1
keywords: wb97x-d3
keywords: def2-TZVPP
keywords: def2/J RIJCOSX
keywords: DEFGRID2
keywords: scfconv7
keywords: smallprint printgap noloewdin
keywords: NOSOSCF
formula: C23H26O3
InChI: InChI=1/C23H26O3/c1-16(2)13-20-21(23(20,3)4)22(24)25-15-17-9-8-12-19(14-17)26-18-10-6-5-7-11-18/h5-14,20-21H,15H2,1-4H3
52 atoms
O  -2.320867 0.673252 -1.289058
O  -2.575079 2.585549 -0.174455
O  2.32964 -0.32343 0.424031
C  -4.698673 -0.389213 0.319538
C  -3.464906 -0.794613 1.054772
C  -3.667168 0.672496 0.65557
C  -5.976468 -0.297548 1.12143
C  -4.946296 -0.832919 -1.101199
C  -2.438044 -1.690264 0.473718
C  -2.815036 1.405295 -0.296374
C  -1.301288 -2.051217 1.077659
C  -0.380831 -3.05837 0.45743
C  -0.839284 -1.503703 2.39282
C  -1.405986 1.304958 -2.188665
C  -0.070863 1.549565 -1.543115
C  0.575375 0.505894 -0.888464
C  0.532117 2.798861 -1.600937
C  1.798913 0.723192 -0.276912
C  1.76848 3.00029 -1.001457
C  2.407299 1.972508 -0.326376
C  3.66938 -0.589045 0.394692
C  4.226819 -1.106551 1.556392
C  4.442251 -0.423071 -0.748412
C  5.568075 -1.459094 1.573134
C  5.785721 -0.769091 -0.712127
C  6.355612 -1.286518 0.442898
H  -3.602308 -0.922845 2.124264
H  -3.947167 1.319666 1.478886
H  -6.671454 0.415427 0.67301
H  -5.793033 0.019425 2.1490
H  -6.475066 -1.268433 1.158552
H  -5.575721 -0.108052 -1.62116
H  -5.482818 -1.784074 -1.09585
H  -4.048374 -0.972198 -1.695887
H  -2.658418 -2.135162 -0.491222
H  -0.270322 -3.934394 1.103101
H  0.624044 -2.650216 0.32407
H  -0.737889 -3.402682 -0.513315
H  -1.478317 -0.714406 2.78513
H  0.169526 -1.093261 2.297581
H  -0.777801 -2.293287 3.147043
H  -1.825665 2.229877 -2.588187
H  -1.310244 0.600234 -3.014744
H  0.125058 -0.478921 -0.8403
H  0.034191 3.618136 -2.104373
H  2.233152 3.976986 -1.039575
H  3.358237 2.149428 0.160218
H  3.610568 -1.23584 2.437647
H  4.009914 -0.035513 -1.662301
H  5.998726 -1.864616 2.479691
H  6.387354 -0.639622 -1.602631
H  7.403184 -1.556662 0.460514
elementType: O C H
totalener: -1117.86441131 hartree
nucrepener: 2303.03031030 hartree
electener: -3420.89472161 hartree
oneelecener: -6095.87442613 hartree
twoeener: 2674.97970452 hartree
cpcmener: -0.02606299 hartree
kineticenergy: 1112.80958262 hartree
xcener: -110.230328775237 hartree
chargesum: -0.0000000
charge: -0.271767 -0.470461 -0.328854 0.141029 -0.025839 -0.120758 -0.263084 -0.293329 -0.247107 0.407321 -0.061243 -0.225890 -0.254575 0.066061 0.058381 -0.299792 -0.203808 0.280070 -0.118032 -0.214921 0.306481 -0.266194 -0.208839 -0.111421 -0.140682 -0.190709 0.109460 0.091000 0.095707 0.086223 0.093543 0.103202 0.099648 0.091319 0.120384 0.107653 0.079480 0.092954 0.090321 0.082718 0.104368 0.115494 0.116360 0.145786 0.139955 0.157498 0.157141 0.148405 0.156332 0.157385 0.158438 0.157187
qa: -0.2718 -0.4705 -0.3289 0.1410 -0.0258 -0.1208 -0.2631 -0.2933 -0.2471 0.4073 -0.0612 -0.2259 -0.2546 0.0661 0.0584 -0.2998 -0.2038 0.2801 -0.1180 -0.2149 0.3065 -0.2662 -0.2088 -0.1114 -0.1407 -0.1907 0.1095 0.0910 0.0957 0.0862 0.0935 0.1032 0.0996 0.0913 0.1204 0.1077 0.0795 0.0930 0.0903 0.0827 0.1044 0.1155 0.1164 0.1458 0.1400 0.1575 0.1571 0.1484 0.1563 0.1574 0.1584 0.1572
va: 2.1051 2.0399 2.0441 3.7573 3.7630 3.8615 3.8980 3.9022 3.8197 4.1476 3.7233 3.9038 3.9372 3.8211 3.6281 4.0393 3.9513 3.7374 3.8999 3.9607 3.6583 3.9980 3.9317 3.8745 3.9021 3.9095 1.0030 1.0293 1.0018 1.0057 1.0022 0.9998 0.9992 1.0131 1.0061 0.9964 1.0088 1.0075 1.0074 1.0104 0.9979 1.0071 0.9963 1.0081 1.0044 0.9900 0.9950 1.0046 0.9987 0.9898 0.9903 0.9909
dispcorr: -0.027464068 hartree
energy: -1117.891875377688
dipole: -15.96174 16.29380 0.33205 -12.36492 11.37501 -0.98991 4.35755 -4.78307 -0.42552
magnitude: 1.12749 au
magnitude: 2.86585 debye
