program: Orca
programVersion: 5.0.2
elementType: O O O C C C C C C C C C C C C C C C C C C C C C C C H H H H H H H H H H H H H H H H H H H H H H H H H H
charge: 0
multiplicity: 1
keywords: wb97x-d3
keywords: def2-TZVPP
keywords: def2/J RIJCOSX
keywords: DEFGRID2
keywords: scfconv7
keywords: smallprint printgap noloewdin
keywords: NOSOSCF
formula: C23H26O3
InChI: InChI=1/C23H26O3/c1-16(2)13-20-21(23(20,3)4)22(24)25-15-17-9-8-12-19(14-17)26-18-10-6-5-7-11-18/h5-14,20-21H,15H2,1-4H3
52 atoms
O  -1.564821 1.894011 0.243558
O  -0.618145 0.006834 0.979971
O  3.692157 0.88738 -1.391049
C  -2.839399 -1.477264 -0.585035
C  -3.462294 -1.155744 0.727368
C  -2.768635 -0.048602 -0.077472
C  -3.771027 -1.675319 -1.75828
C  -1.610015 -2.348323 -0.668565
C  -2.9344 -1.641765 2.023928
C  -1.537139 0.57154 0.435788
C  -3.222755 -1.063871 3.193011
C  -2.741784 -1.627718 4.492928
C  -4.056298 0.183821 3.275797
C  -0.419527 2.665972 0.633008
C  0.618748 2.64883 -0.45155
C  1.696111 1.774721 -0.382586
C  0.480472 3.484404 -1.55712
C  2.608876 1.720997 -1.427989
C  1.412423 3.441381 -2.581819
C  2.475283 2.550882 -2.530359
C  3.538712 -0.406957 -0.975271
C  4.592484 -0.96866 -0.267302
C  2.411593 -1.160808 -1.283671
C  4.517253 -2.294646 0.133507
C  2.347599 -2.483009 -0.86817
C  3.394457 -3.056456 -0.158937
H  -4.543006 -1.035973 0.706609
H  -3.438183 0.648762 -0.567262
H  -4.657024 -1.04254 -1.688853
H  -4.109304 -2.712461 -1.808491
H  -3.269692 -1.444026 -2.700365
H  -1.913292 -3.392337 -0.772571
H  -0.955757 -2.282839 0.195487
H  -1.021345 -2.091555 -1.551698
H  -2.322897 -2.53872 2.017681
H  -2.164833 -2.542756 4.358049
H  -3.580749 -1.852541 5.157434
H  -2.113852 -0.907191 5.024024
H  -5.115322 -0.028937 3.105206
H  -3.758544 0.926968 2.533582
H  -3.980996 0.651324 4.258021
H  -0.015971 2.314991 1.583373
H  -0.803682 3.674233 0.782592
H  1.819222 1.136308 0.483207
H  -0.352573 4.174736 -1.611756
H  1.308193 4.097232 -3.436346
H  3.198343 2.503861 -3.335081
H  5.465177 -0.370786 -0.035379
H  1.591214 -0.732378 -1.845748
H  5.341144 -2.729131 0.685033
H  1.470454 -3.069931 -1.109575
H  3.335827 -4.088421 0.160952
elementType: O C H
totalener: -1117.86489024 hartree
nucrepener: 2303.48314053 hartree
electener: -3421.34803077 hartree
oneelecener: -6097.27617139 hartree
twoeener: 2675.92814062 hartree
cpcmener: -0.02546364 hartree
kineticenergy: 1112.81239271 hartree
xcener: -110.226797538170 hartree
chargesum: -0.0000000
charge: -0.295611 -0.469211 -0.332860 0.149214 -0.044444 -0.081417 -0.262584 -0.323098 -0.259934 0.392678 -0.011476 -0.221739 -0.277837 0.079241 -0.015181 -0.151838 -0.225443 0.242204 -0.121915 -0.236156 0.296989 -0.252493 -0.200480 -0.118052 -0.142590 -0.197647 0.113041 0.092383 0.086010 0.093834 0.095864 0.102967 0.094004 0.101957 0.121637 0.085276 0.098103 0.095033 0.104861 0.094448 0.095741 0.113069 0.124293 0.144127 0.142725 0.157866 0.146339 0.144716 0.153923 0.156574 0.166253 0.156634
qa: -0.2956 -0.4692 -0.3329 0.1492 -0.0444 -0.0814 -0.2626 -0.3231 -0.2599 0.3927 -0.0115 -0.2217 -0.2778 0.0792 -0.0152 -0.1518 -0.2254 0.2422 -0.1219 -0.2362 0.2970 -0.2525 -0.2005 -0.1181 -0.1426 -0.1976 0.1130 0.0924 0.0860 0.0938 0.0959 0.1030 0.0940 0.1020 0.1216 0.0853 0.0981 0.0950 0.1049 0.0944 0.0957 0.1131 0.1243 0.1441 0.1427 0.1579 0.1463 0.1447 0.1539 0.1566 0.1663 0.1566
va: 2.1071 2.0127 2.0757 3.7538 3.8283 3.8113 3.8960 3.8964 3.8162 4.0970 3.6983 3.9231 3.9497 3.8155 3.6408 3.8752 3.9789 3.7590 3.8925 4.0196 3.6997 4.0071 3.8857 3.8894 3.8739 3.9339 1.0021 1.0312 1.0051 1.0025 1.0024 1.0002 1.0126 0.9957 1.0013 1.0088 0.9931 0.9945 0.9965 1.0026 1.0050 1.0136 0.9942 1.0220 1.0035 0.9888 1.0056 1.0085 0.9982 0.9888 0.9843 0.9920
dispcorr: -0.026292887 hartree
energy: -1117.891183131847
dipole: -23.61252 22.31122 -1.30130 -12.13903 12.45478 0.31575 9.92548 -10.07283 -0.14735
magnitude: 1.34714 au
magnitude: 3.42416 debye
