program: Orca
programVersion: 5.0.2
elementType: O O O C C C C C C C C C C C C C C C C C C C C C C C H H H H H H H H H H H H H H H H H H H H H H H H H H
charge: 0
multiplicity: 1
keywords: wb97x-d3
keywords: def2-TZVPP
keywords: def2/J RIJCOSX
keywords: DEFGRID2
keywords: scfconv7
keywords: smallprint printgap noloewdin
keywords: NOSOSCF
formula: C23H26O3
InChI: InChI=1/C23H26O3/c1-16(2)13-20-21(23(20,3)4)22(24)25-15-17-9-8-12-19(14-17)26-18-10-6-5-7-11-18/h5-14,20-21H,15H2,1-4H3
52 atoms
O  -1.48265 1.709245 1.531524
O  -2.59273 1.628222 -0.401549
O  3.263917 0.817714 -0.351264
C  -3.61632 -1.157539 0.447178
C  -2.177276 -1.47128 0.160955
C  -2.551802 -0.281951 1.058953
C  -4.316416 -2.067549 1.429859
C  -4.536115 -0.671385 -0.647097
C  -1.554627 -1.277907 -1.161801
C  -2.247924 1.093832 0.625268
C  -0.737552 -2.137209 -1.783167
C  -0.162373 -1.801499 -3.126891
C  -0.313801 -3.47224 -1.253027
C  -0.892577 2.957688 1.148678
C  0.168181 2.740789 0.105974
C  1.228076 1.885721 0.394533
C  0.087169 3.346069 -1.141153
C  2.182352 1.619677 -0.57659
C  1.062832 3.093834 -2.095996
C  2.10435 2.221014 -1.827157
C  3.187273 -0.254978 0.494406
C  2.091578 -1.110319 0.520696
C  4.295613 -0.500817 1.292862
C  2.110898 -2.206507 1.371207
C  4.307065 -1.611045 2.124925
C  3.213673 -2.464043 2.174549
H  -1.776627 -2.298042 0.736577
H  -2.354387 -0.450729 2.111604
H  -5.150721 -1.554197 1.913033
H  -3.64468 -2.418522 2.214789
H  -4.716985 -2.946617 0.920822
H  -4.036325 -0.141776 -1.452146
H  -5.305615 -0.011323 -0.242453
H  -5.045496 -1.529649 -1.090138
H  -1.779502 -0.354329 -1.682976
H  -0.481163 -0.820953 -3.480779
H  -0.452986 -2.54155 -3.877584
H  0.930847 -1.808205 -3.096213
H  -0.647294 -4.268999 -1.923819
H  -0.69852 -3.700827 -0.261302
H  0.776268 -3.543254 -1.215072
H  -0.463315 3.350637 2.070027
H  -1.650899 3.663369 0.805165
H  1.300346 1.430786 1.375497
H  -0.73945 4.006517 -1.370445
H  1.000184 3.563101 -3.069243
H  2.856408 2.008064 -2.5765
H  1.22833 -0.932828 -0.109927
H  5.144558 0.170523 1.256925
H  1.254667 -2.86826 1.398466
H  5.174862 -1.8025 2.742836
H  3.220768 -3.323897 2.831397
elementType: O C H
totalener: -1117.86590182 hartree
nucrepener: 2367.57358790 hartree
electener: -3485.43948972 hartree
oneelecener: -6224.91076904 hartree
twoeener: 2739.47127932 hartree
cpcmener: -0.02411806 hartree
kineticenergy: 1112.80441106 hartree
xcener: -110.229585684937 hartree
chargesum: -0.0000000
charge: -0.289139 -0.457221 -0.327884 0.128006 0.016253 -0.088260 -0.265532 -0.283686 -0.283583 0.369581 -0.042808 -0.229228 -0.278470 0.088477 0.028582 -0.252936 -0.215746 0.310060 -0.103374 -0.271749 0.269817 -0.154168 -0.232003 -0.168531 -0.129462 -0.183271 0.111245 0.097707 0.093844 0.086227 0.094363 0.095505 0.101946 0.092824 0.120736 0.087883 0.100052 0.091131 0.112781 0.092219 0.091450 0.125157 0.111818 0.138357 0.140089 0.156835 0.144767 0.138998 0.144092 0.162821 0.156797 0.156631
qa: -0.2891 -0.4572 -0.3279 0.1280 0.0163 -0.0883 -0.2655 -0.2837 -0.2836 0.3696 -0.0428 -0.2292 -0.2785 0.0885 0.0286 -0.2529 -0.2157 0.3101 -0.1034 -0.2717 0.2698 -0.1542 -0.2320 -0.1685 -0.1295 -0.1833 0.1112 0.0977 0.0938 0.0862 0.0944 0.0955 0.1019 0.0928 0.1207 0.0879 0.1001 0.0911 0.1128 0.0922 0.0914 0.1252 0.1118 0.1384 0.1401 0.1568 0.1448 0.1390 0.1441 0.1628 0.1568 0.1566
va: 2.1096 2.0414 2.0878 3.7378 3.7423 3.8463 3.9072 3.8999 3.8152 4.1584 3.7423 3.9201 3.9360 3.8214 3.6137 3.9311 3.9473 3.6869 3.8851 4.0030 3.7582 3.8552 3.9867 3.8965 3.8959 3.9257 1.0044 1.0280 1.0022 1.0049 1.0022 1.0131 1.0004 1.0015 1.0192 1.0090 0.9978 0.9964 1.0008 1.0101 0.9946 0.9941 1.0089 1.0151 1.0079 0.9887 1.0078 1.0100 1.0088 0.9883 0.9889 0.9916
dispcorr: -0.028594668 hartree
energy: -1117.894496488087
dipole: -15.49802 15.53142 0.03339 -18.21664 17.36645 -0.85019 -5.03855 5.87475 0.83621
magnitude: 1.19297 au
magnitude: 3.03229 debye
