program: Orca
programVersion: 5.0.2
elementType: O O O C C C C C C C C C C C C C C C C C C C C C C C H H H H H H H H H H H H H H H H H H H H H H H H H H
charge: 0
multiplicity: 1
keywords: wb97x-d3
keywords: def2-TZVPP
keywords: def2/J RIJCOSX
keywords: DEFGRID2
keywords: scfconv7
keywords: smallprint printgap noloewdin
keywords: NOSOSCF
formula: C23H26O3
InChI: InChI=1/C23H26O3/c1-16(2)13-20-21(23(20,3)4)22(24)25-15-17-9-8-12-19(14-17)26-18-10-6-5-7-11-18/h5-14,20-21H,15H2,1-4H3
52 atoms
O  -1.949742 1.468298 -2.058878
O  -0.987754 -0.493865 -1.604327
O  3.303541 0.985168 0.047173
C  -3.466743 -1.251594 0.022206
C  -2.996856 -0.074042 0.822462
C  -3.145945 0.036941 -0.692971
C  -4.942404 -1.569181 0.103517
C  -2.616603 -2.491726 -0.120309
C  -1.659927 0.036203 1.465814
C  -1.923249 0.259341 -1.488995
C  -1.257081 -0.658846 2.532732
C  0.081559 -0.414045 3.160952
C  -2.085096 -1.715142 3.195904
C  -0.718277 1.966585 -2.603579
C  0.236039 2.277596 -1.485161
C  1.374322 1.507625 -1.293523
C  -0.072928 3.288959 -0.578422
C  2.172711 1.721264 -0.177368
C  0.745785 3.512766 0.51628
C  1.864794 2.719846 0.733572
C  3.279573 -0.375968 -0.07935
C  2.144634 -1.140868 0.166304
C  4.479492 -0.98649 -0.422409
C  2.22124 -2.522208 0.05597
C  4.541886 -2.368607 -0.518599
C  3.413882 -3.143994 -0.286124
H  -3.784263 0.456381 1.353547
H  -3.993209 0.627168 -1.024856
H  -5.1523 -2.200986 0.969463
H  -5.277305 -2.106294 -0.78649
H  -5.552562 -0.669249 0.195746
H  -2.732837 -2.934421 -1.111272
H  -2.949769 -3.237087 0.604364
H  -1.557331 -2.322914 0.049671
H  -0.990963 0.801572 1.077956
H  0.632869 0.38424 2.66352
H  0.699413 -1.315729 3.138868
H  -0.026338 -0.140857 4.214164
H  -3.065725 -1.842334 2.740718
H  -2.236666 -1.475004 4.25184
H  -1.573399 -2.680883 3.172213
H  -1.003188 2.867316 -3.145829
H  -0.290117 1.262788 -3.319207
H  1.620431 0.726074 -2.001906
H  -0.956473 3.898315 -0.725408
H  0.506097 4.299698 1.219553
H  2.496006 2.877031 1.599237
H  1.205232 -0.679376 0.441661
H  5.357959 -0.380872 -0.607838
H  1.33381 -3.1133 0.243613
H  5.47974 -2.839079 -0.784906
H  3.463983 -4.221539 -0.37036
elementType: O C H
totalener: -1117.86230465 hartree
nucrepener: 2392.06399654 hartree
electener: -3509.92630119 hartree
oneelecener: -6274.30198626 hartree
twoeener: 2764.37568507 hartree
cpcmener: -0.02369847 hartree
kineticenergy: 1112.80644639 hartree
xcener: -110.228632002276 hartree
chargesum: 0.0000000
charge: -0.284834 -0.450752 -0.331061 0.097042 0.006177 -0.092494 -0.273483 -0.275260 -0.230572 0.363271 -0.016681 -0.244906 -0.261439 0.075459 0.005375 -0.166148 -0.226641 0.275219 -0.097175 -0.265182 0.295767 -0.151125 -0.234447 -0.185184 -0.137890 -0.166927 0.107946 0.096452 0.091946 0.098393 0.086218 0.108592 0.090680 0.081473 0.075932 0.084840 0.096236 0.108461 0.088986 0.107513 0.101195 0.127005 0.113964 0.137976 0.139269 0.157655 0.146590 0.111267 0.143740 0.157931 0.156693 0.156937
qa: -0.2848 -0.4508 -0.3311 0.0970 0.0062 -0.0925 -0.2735 -0.2753 -0.2306 0.3633 -0.0167 -0.2449 -0.2614 0.0755 0.0054 -0.1661 -0.2266 0.2752 -0.0972 -0.2652 0.2958 -0.1511 -0.2344 -0.1852 -0.1379 -0.1669 0.1079 0.0965 0.0919 0.0984 0.0862 0.1086 0.0907 0.0815 0.0759 0.0848 0.0962 0.1085 0.0890 0.1075 0.1012 0.1270 0.1140 0.1380 0.1393 0.1577 0.1466 0.1113 0.1437 0.1579 0.1567 0.1569
va: 2.1082 2.0416 2.0864 3.7183 3.7675 3.8387 3.9047 3.8826 3.8469 4.1757 3.6473 3.9277 3.9285 3.8300 3.5857 3.9010 3.9344 3.7086 3.8438 3.9802 3.6951 3.8517 3.9775 3.9367 3.9061 3.8956 1.0044 1.0276 1.0034 1.0011 1.0047 1.0049 0.9993 1.0094 1.0170 1.0001 0.9963 1.0013 1.0057 1.0009 0.9958 0.9936 1.0092 1.0151 1.0083 0.9878 1.0065 1.0037 1.0093 0.9913 0.9891 0.9906
dispcorr: -0.031156973 hartree
energy: -1117.893461622266
dipole: -17.72536 16.62063 -1.10472 -13.11186 13.41834 0.30648 13.64464 -13.20020 0.44444
magnitude: 1.22958 au
magnitude: 3.12535 debye
