program: Orca
programVersion: 5.0.2
elementType: O O O C C C C C C C C C C C C C C C C C C C C C C C H H H H H H H H H H H H H H H H H H H H H H H H H H
charge: 0
multiplicity: 1
keywords: wb97x-d3
keywords: def2-TZVPP
keywords: def2/J RIJCOSX
keywords: DEFGRID2
keywords: scfconv7
keywords: smallprint printgap noloewdin
keywords: NOSOSCF
formula: C23H26O3
InChI: InChI=1/C23H26O3/c1-16(2)13-20-21(23(20,3)4)22(24)25-15-17-9-8-12-19(14-17)26-18-10-6-5-7-11-18/h5-14,20-21H,15H2,1-4H3
52 atoms
O  -2.312636 0.604604 -1.286499
O  -2.621719 2.574757 -0.29104
O  2.400954 -0.409954 0.390348
C  -4.757397 -0.367829 0.285157
C  -3.551026 -0.745241 1.077546
C  -3.728902 0.701878 0.60485
C  -6.061021 -0.227451 1.03663
C  -4.957059 -0.878194 -1.120678
C  -2.515072 -1.677684 0.572084
C  -2.847468 1.386949 -0.355871
C  -1.363745 -1.9540 1.191771
C  -0.436013 -3.009915 0.672028
C  -0.897734 -1.258063 2.433489
C  -1.369475 1.191986 -2.189827
C  -0.055673 1.461678 -1.512482
C  0.627265 0.411714 -0.906076
C  0.483938 2.74034 -1.47732
C  1.824886 0.650451 -0.252279
C  1.691625 2.966154 -0.830204
C  2.36555 1.930574 -0.203421
C  3.752152 -0.607916 0.355597
C  4.322507 -1.196039 1.476878
C  4.529035 -0.305283 -0.756613
C  5.68003 -1.479859 1.484881
C  5.888274 -0.584666 -0.728533
C  6.471134 -1.170226 0.386784
H  -3.722475 -0.822801 2.147415
H  -4.032687 1.389031 1.386258
H  -6.572298 -1.190335 1.100583
H  -6.731564 0.471434 0.53227
H  -5.909762 0.134367 2.054611
H  -4.038612 -1.050319 -1.674238
H  -5.562753 -0.176797 -1.6978
H  -5.49921 -1.825715 -1.089208
H  -2.745908 -2.227219 -0.335166
H  0.56023 -2.605088 0.478681
H  -0.801711 -3.464496 -0.248775
H  -0.303198 -3.807674 1.40854
H  -0.850266 -1.951056 3.278278
H  -1.528518 -0.419418 2.723871
H  0.11681 -0.874807 2.295419
H  -1.77474 2.098597 -2.642074
H  -1.253259 0.449446 -2.97894
H  0.226636 -0.595298 -0.93478
H  -0.042544 3.563191 -1.944351
H  2.105363 3.965511 -0.793591
H  3.294013 2.123477 0.319143
H  3.703492 -1.433657 2.333253
H  4.089466 0.138909 -1.640677
H  6.119911 -1.941457 2.359606
H  6.492971 -0.344679 -1.593702
H  7.531231 -1.386439 0.398533
elementType: O C H
totalener: -1117.86419733 hartree
nucrepener: 2300.39073600 hartree
electener: -3418.25493334 hartree
oneelecener: -6090.59828824 hartree
twoeener: 2672.34335490 hartree
cpcmener: -0.02585933 hartree
kineticenergy: 1112.80864776 hartree
xcener: -110.229435962960 hartree
chargesum: 0.0000000
charge: -0.269421 -0.472343 -0.329091 0.147632 -0.030985 -0.131029 -0.263907 -0.296260 -0.239510 0.413666 -0.058625 -0.232362 -0.258269 0.064578 0.063382 -0.320577 -0.196583 0.291751 -0.120823 -0.217465 0.308473 -0.266162 -0.210987 -0.112978 -0.141708 -0.191100 0.110667 0.091011 0.093251 0.095867 0.086171 0.091003 0.103296 0.099596 0.121392 0.080112 0.093979 0.106304 0.106682 0.091509 0.083665 0.115456 0.117575 0.151553 0.139684 0.157911 0.158559 0.147367 0.155083 0.157206 0.158408 0.157394
qa: -0.2694 -0.4723 -0.3291 0.1476 -0.0310 -0.1310 -0.2639 -0.2963 -0.2395 0.4137 -0.0586 -0.2324 -0.2583 0.0646 0.0634 -0.3206 -0.1966 0.2918 -0.1208 -0.2175 0.3085 -0.2662 -0.2110 -0.1130 -0.1417 -0.1911 0.1107 0.0910 0.0933 0.0959 0.0862 0.0910 0.1033 0.0996 0.1214 0.0801 0.0940 0.1063 0.1067 0.0915 0.0837 0.1155 0.1176 0.1516 0.1397 0.1579 0.1586 0.1474 0.1551 0.1572 0.1584 0.1574
va: 2.1068 2.0391 2.0445 3.7445 3.7736 3.8676 3.8991 3.9035 3.8119 4.1430 3.7174 3.9092 3.9372 3.8253 3.6093 4.0442 3.9483 3.7056 3.9031 3.9651 3.6666 3.9986 3.9284 3.8762 3.9037 3.9093 1.0028 1.0293 1.0022 1.0018 1.0056 1.0125 0.9998 0.9990 1.0039 1.0101 1.0066 0.9972 0.9980 1.0063 1.0087 1.0066 0.9970 1.0023 1.0068 0.9901 0.9944 1.0054 0.9993 0.9899 0.9903 0.9908
dispcorr: -0.027497219 hartree
energy: -1117.891694553851
dipole: -16.34545 16.68981 0.34436 -11.58286 10.64958 -0.93328 4.81515 -5.15374 -0.33859
magnitude: 1.05083 au
magnitude: 2.67099 debye
