program: Orca
programVersion: 5.0.2
elementType: O O O C C C C C C C C C C C C C C C C C C C C C C C H H H H H H H H H H H H H H H H H H H H H H H H H H
charge: 0
multiplicity: 1
keywords: wb97x-d3
keywords: def2-TZVPP
keywords: def2/J RIJCOSX
keywords: DEFGRID2
keywords: scfconv7
keywords: smallprint printgap noloewdin
keywords: NOSOSCF
formula: C23H26O3
InChI: InChI=1/C23H26O3/c1-16(2)13-20-21(23(20,3)4)22(24)25-15-17-9-8-12-19(14-17)26-18-10-6-5-7-11-18/h5-14,20-21H,15H2,1-4H3
52 atoms
O  -2.309659 0.592589 -1.294899
O  -2.614843 2.567431 -0.307901
O  2.415811 -0.416133 0.392767
C  -4.765428 -0.369198 0.267839
C  -3.569447 -0.732567 1.082326
C  -3.743187 0.706885 0.584433
C  -6.07934 -0.217983 0.999222
C  -4.945745 -0.903905 -1.131584
C  -2.527317 -1.67253 0.604236
C  -2.845888 1.380425 -0.369711
C  -1.379793 -1.934671 1.236852
C  -0.447174 -2.998219 0.742095
C  -0.921958 -1.214183 2.467333
C  -1.357431 1.174165 -2.193338
C  -0.04984 1.449174 -1.506311
C  0.639051 0.400188 -0.904932
C  0.478007 2.732343 -1.456772
C  1.831042 0.644169 -0.242676
C  1.679521 2.963755 -0.800476
C  2.359335 1.928718 -0.179116
C  3.76768 -0.60727 0.347227
C  4.346432 -1.211193 1.455817
C  4.538314 -0.281283 -0.76273
C  5.70544 -1.487619 1.453204
C  5.899213 -0.553679 -0.745139
C  6.490112 -1.155644 0.357083
H  -3.754483 -0.793391 2.151021
H  -4.05973 1.404994 1.350877
H  -5.942171 0.163592 2.011947
H  -6.589302 -1.180699 1.07499
H  -6.744821 0.469535 0.473015
H  -5.543017 -0.213389 -1.730108
H  -5.488687 -1.850537 -1.090049
H  -4.019895 -1.086543 -1.669004
H  -2.750006 -2.240528 -0.293512
H  -0.309782 -3.776943 1.497812
H  0.546642 -2.592838 0.537656
H  -0.81169 -3.47678 -0.166884
H  -1.564399 -0.381067 2.747486
H  0.086657 -0.818379 2.320682
H  -0.861806 -1.894233 3.32155
H  -1.758842 2.07744 -2.655643
H  -1.233731 0.425969 -2.975898
H  0.247993 -0.610194 -0.945279
H  -0.053014 3.554314 -1.92014
H  2.083687 3.966553 -0.752736
H  3.282887 2.125317 0.350759
H  3.732876 -1.465993 2.311077
H  4.092943 0.17529 -1.637479
H  6.151593 -1.961391 2.318151
H  6.498622 -0.295907 -1.608856
H  7.551418 -1.366146 0.3607
elementType: O C H
totalener: -1117.86419626 hartree
nucrepener: 2299.06879692 hartree
electener: -3416.93299318 hartree
oneelecener: -6087.95992292 hartree
twoeener: 2671.02692974 hartree
cpcmener: -0.02585325 hartree
kineticenergy: 1112.80844299 hartree
xcener: -110.229204549706 hartree
chargesum: 0.0000000
charge: -0.269663 -0.472465 -0.329484 0.149410 -0.031148 -0.133787 -0.264158 -0.296744 -0.241283 0.415742 -0.055365 -0.232933 -0.258191 0.064991 0.063255 -0.320593 -0.194738 0.291247 -0.122056 -0.216023 0.309022 -0.266342 -0.210636 -0.113512 -0.142537 -0.191188 0.110440 0.090939 0.086302 0.093330 0.095756 0.103292 0.099561 0.091038 0.121534 0.105850 0.079822 0.094013 0.091330 0.084668 0.106237 0.115754 0.117717 0.150741 0.139479 0.157849 0.158894 0.147017 0.154780 0.157042 0.158434 0.157358
qa: -0.2697 -0.4725 -0.3295 0.1494 -0.0311 -0.1338 -0.2642 -0.2967 -0.2413 0.4157 -0.0554 -0.2329 -0.2582 0.0650 0.0633 -0.3206 -0.1947 0.2912 -0.1221 -0.2160 0.3090 -0.2663 -0.2106 -0.1135 -0.1425 -0.1912 0.1104 0.0909 0.0863 0.0933 0.0958 0.1033 0.0996 0.0910 0.1215 0.1059 0.0798 0.0940 0.0913 0.0847 0.1062 0.1158 0.1177 0.1507 0.1395 0.1578 0.1589 0.1470 0.1548 0.1570 0.1584 0.1574
va: 2.1075 2.0390 2.0434 3.7420 3.7750 3.8684 3.8992 3.9037 3.8139 4.1417 3.7158 3.9102 3.9381 3.8255 3.6061 4.0444 3.9475 3.6995 3.9041 3.9658 3.6679 3.9995 3.9259 3.8771 3.9040 3.9091 1.0030 1.0295 1.0055 1.0022 1.0018 0.9999 0.9990 1.0124 1.0036 0.9976 1.0101 1.0066 1.0064 1.0074 0.9981 1.0063 0.9970 1.0028 1.0074 0.9901 0.9941 1.0058 0.9995 0.9899 0.9904 0.9908
dispcorr: -0.027435835 hartree
energy: -1117.891632089782
dipole: -16.44752 16.78052 0.33301 -11.48278 10.56496 -0.91782 4.91025 -5.24328 -0.33303
magnitude: 1.03160 au
magnitude: 2.62211 debye
