program: Orca
programVersion: 5.0.2
elementType: O O O C C C C C C C C C C C C C C C C C C C C C C C H H H H H H H H H H H H H H H H H H H H H H H H H H
charge: 0
multiplicity: 1
keywords: wb97x-d3
keywords: def2-TZVPP
keywords: def2/J RIJCOSX
keywords: DEFGRID2
keywords: scfconv7
keywords: smallprint printgap noloewdin
keywords: NOSOSCF
formula: C23H26O3
InChI: InChI=1/C23H26O3/c1-16(2)13-20-21(23(20,3)4)22(24)25-15-17-9-8-12-19(14-17)26-18-10-6-5-7-11-18/h5-14,20-21H,15H2,1-4H3
52 atoms
O  -2.03666 2.328746 0.222335
O  -2.553177 1.010781 -1.50145
O  3.04171 1.43734 0.635921
C  -4.153993 -0.714965 0.522112
C  -2.741734 -1.134582 0.793457
C  -3.112272 0.35669 0.745407
C  -5.130937 -0.886564 1.663287
C  -4.797014 -0.944373 -0.823945
C  -1.872052 -1.760411 -0.218532
C  -2.566826 1.225236 -0.312608
C  -0.974707 -2.728011 0.006661
C  -0.163647 -3.288607 -1.124159
C  -0.678151 -3.346087 1.338669
C  -1.300582 3.196613 -0.646818
C  0.01838 2.58674 -1.029439
C  0.930207 2.251095 -0.031267
C  0.333324 2.327436 -2.356514
C  2.142772 1.678037 -0.36974
C  1.552889 1.748738 -2.684433
C  2.464481 1.416164 -1.696184
C  3.521544 0.173451 0.82769
C  2.791784 -0.967417 0.514087
C  4.779075 0.06992 1.410276
C  3.335946 -2.214588 0.792163
C  5.304088 -1.182643 1.6881
C  4.588131 -2.331568 1.378398
H  -2.563492 -1.464433 1.810455
H  -3.139313 0.834667 1.717912
H  -5.96743 -0.190111 1.572362
H  -4.661939 -0.716356 2.633674
H  -5.54052 -1.898768 1.66745
H  -4.108145 -0.926938 -1.662548
H  -5.566787 -0.193761 -1.013178
H  -5.287152 -1.920107 -0.824955
H  -1.973666 -1.414682 -1.240416
H  -0.37651 -2.793265 -2.071617
H  -0.354942 -4.357786 -1.252496
H  0.907809 -3.19125 -0.927801
H  -1.306301 -2.984502 2.149706
H  0.361937 -3.163646 1.622797
H  -0.795758 -4.431581 1.291096
H  -1.15288 4.104673 -0.062599
H  -1.886039 3.459626 -1.52953
H  0.705127 2.44428 1.011389
H  -0.373713 2.576931 -3.137607
H  1.794795 1.551189 -3.720637
H  3.416966 0.969689 -1.954485
H  1.806889 -0.896426 0.068535
H  5.337285 0.967035 1.647796
H  2.766815 -3.103072 0.54913
H  6.283301 -1.257853 2.143272
H  5.001322 -3.308154 1.593534
elementType: O C H
totalener: -1117.86642267 hartree
nucrepener: 2309.37928951 hartree
electener: -3427.24571219 hartree
oneelecener: -6108.60269052 hartree
twoeener: 2681.35697833 hartree
cpcmener: -0.02497607 hartree
kineticenergy: 1112.80382058 hartree
xcener: -110.227349387897 hartree
chargesum: -0.0000000
charge: -0.291283 -0.464668 -0.331210 0.107113 0.041840 -0.094350 -0.262624 -0.282741 -0.281862 0.388404 -0.080500 -0.218833 -0.249209 0.094562 0.003927 -0.249111 -0.173686 0.227355 -0.143794 -0.169390 0.267613 -0.147427 -0.240732 -0.158920 -0.126296 -0.200714 0.115583 0.094951 0.093673 0.086039 0.095215 0.096036 0.100467 0.094438 0.121092 0.091800 0.102288 0.083198 0.090563 0.088690 0.097759 0.124378 0.111792 0.130131 0.141380 0.158030 0.158363 0.151267 0.144134 0.151192 0.156638 0.157438
qa: -0.2913 -0.4647 -0.3312 0.1071 0.0418 -0.0943 -0.2626 -0.2827 -0.2819 0.3884 -0.0805 -0.2188 -0.2492 0.0946 0.0039 -0.2491 -0.1737 0.2274 -0.1438 -0.1694 0.2676 -0.1474 -0.2407 -0.1589 -0.1263 -0.2007 0.1156 0.0950 0.0937 0.0860 0.0952 0.0960 0.1005 0.0944 0.1211 0.0918 0.1023 0.0832 0.0906 0.0887 0.0978 0.1244 0.1118 0.1301 0.1414 0.1580 0.1584 0.1513 0.1441 0.1512 0.1566 0.1574
va: 2.1140 2.0349 2.0647 3.7215 3.7265 3.8441 3.9065 3.8966 3.8336 4.1320 3.8039 3.9195 3.9384 3.8088 3.6270 4.0461 3.9285 3.7692 3.9080 3.9380 3.7563 3.8537 3.9857 3.8959 3.9052 3.9505 1.0030 1.0297 1.0024 1.0053 1.0018 1.0151 0.9993 1.0010 1.0219 1.0097 0.9973 0.9938 1.0160 0.9986 0.9973 0.9938 1.0088 1.0244 1.0079 0.9907 0.9948 0.9944 1.0093 0.9939 0.9886 0.9913
dispcorr: -0.026514374 hartree
energy: -1117.892937047743
dipole: -16.34235 16.29037 -0.05198 -20.00500 19.56106 -0.44394 2.19048 -1.59253 0.59794
magnitude: 0.74654 au
magnitude: 1.89755 debye
