program: Orca
programVersion: 5.0.2
elementType: O O O C C C C C C C C C C C C C C C C C C C C C C C H H H H H H H H H H H H H H H H H H H H H H H H H H
charge: 0
multiplicity: 1
keywords: wb97x-d3
keywords: def2-TZVPP
keywords: def2/J RIJCOSX
keywords: DEFGRID2
keywords: scfconv7
keywords: smallprint printgap noloewdin
keywords: NOSOSCF
formula: C23H26O3
InChI: InChI=1/C23H26O3/c1-16(2)13-20-21(23(20,3)4)22(24)25-15-17-9-8-12-19(14-17)26-18-10-6-5-7-11-18/h5-14,20-21H,15H2,1-4H3
52 atoms
O  -1.810942 1.566772 -0.80037
O  -3.236441 -0.043989 -1.42209
O  3.790368 0.961487 -1.206725
C  -5.06469 0.941733 0.866457
C  -4.075702 0.060681 1.547688
C  -3.589098 1.175132 0.611306
C  -5.72418 2.011249 1.707064
C  -5.981485 0.40168 -0.204213
C  -3.905451 -1.374625 1.214327
C  -2.904685 0.81504 -0.640499
C  -2.801062 -2.081867 1.469023
C  -2.726474 -3.548348 1.175281
C  -1.564927 -1.485037 2.070467
C  -0.975788 1.358768 -1.946625
C  0.213266 0.508437 -1.598493
C  1.469772 1.093843 -1.512661
C  0.076886 -0.856412 -1.350094
C  2.582985 0.324258 -1.197833
C  1.19118 -1.611399 -1.020018
C  2.451519 -1.033936 -0.943718
C  4.782574 0.549931 -0.356423
C  4.559323 0.424764 1.009502
C  6.038523 0.317459 -0.895588
C  5.611252 0.05874 1.835927
C  7.085231 -0.037262 -0.05528
C  6.876186 -0.172486 1.309671
H  -3.882706 0.304966 2.589001
H  -3.161682 2.035769 1.112334
H  -5.055178 2.40136 2.475555
H  -6.608051 1.613446 2.209929
H  -6.04515 2.852349 1.089197
H  -5.571534 -0.434293 -0.762408
H  -6.239433 1.184016 -0.920242
H  -6.912209 0.063663 0.256415
H  -4.756093 -1.886917 0.774833
H  -1.930858 -3.762257 0.45618
H  -3.660571 -3.937141 0.769769
H  -2.487039 -4.11866 2.077111
H  -1.475057 -1.757772 3.126812
H  -1.538322 -0.397473 2.007007
H  -0.667865 -1.869167 1.578101
H  -0.654525 2.352376 -2.257078
H  -1.545364 0.920442 -2.766626
H  1.592103 2.15437 -1.700678
H  -0.890313 -1.335694 -1.425283
H  1.084778 -2.672423 -0.833483
H  3.312796 -1.644788 -0.704862
H  3.57835 0.615411 1.427674
H  6.195364 0.419011 -1.96223
H  5.44029 -0.037269 2.900438
H  8.066528 -0.216639 -0.475394
H  7.693414 -0.45345 1.960771
elementType: O C H
totalener: -1117.86555192 hartree
nucrepener: 2224.02705042 hartree
electener: -3341.89260234 hartree
oneelecener: -5937.82351385 hartree
twoeener: 2595.93091151 hartree
cpcmener: -0.02441561 hartree
kineticenergy: 1112.80031781 hartree
xcener: -110.225364129102 hartree
chargesum: -0.0000000
charge: -0.290410 -0.469252 -0.329445 0.136752 -0.028358 -0.103202 -0.263550 -0.299118 -0.263045 0.396120 -0.019792 -0.217361 -0.278087 0.081953 0.024306 -0.258117 -0.223927 0.260267 -0.158211 -0.166908 0.248232 -0.171787 -0.226716 -0.150565 -0.132389 -0.172570 0.112160 0.092707 0.085877 0.094123 0.095132 0.094490 0.100825 0.097289 0.121259 0.090399 0.088155 0.096492 0.118397 0.095891 0.085891 0.111018 0.115656 0.131362 0.154131 0.158916 0.154561 0.158733 0.146337 0.159135 0.157798 0.158447
qa: -0.2904 -0.4693 -0.3294 0.1368 -0.0284 -0.1032 -0.2636 -0.2991 -0.2630 0.3961 -0.0198 -0.2174 -0.2781 0.0820 0.0243 -0.2581 -0.2239 0.2603 -0.1582 -0.1669 0.2482 -0.1718 -0.2267 -0.1506 -0.1324 -0.1726 0.1122 0.0927 0.0859 0.0941 0.0951 0.0945 0.1008 0.0973 0.1213 0.0904 0.0882 0.0965 0.1184 0.0959 0.0859 0.1110 0.1157 0.1314 0.1541 0.1589 0.1546 0.1587 0.1463 0.1591 0.1578 0.1584
va: 2.1135 2.0159 2.0667 3.7497 3.8180 3.8398 3.8994 3.8947 3.8458 4.1067 3.6946 3.9244 3.9409 3.8052 3.6960 4.0923 3.8712 3.7569 3.9045 3.8975 3.7169 3.9147 4.0005 3.8942 3.8875 3.8946 1.0039 1.0317 1.0047 1.0022 1.0025 1.0173 1.0003 0.9989 1.0017 0.9973 1.0082 0.9953 0.9984 1.0058 1.0024 1.0015 1.0160 1.0190 1.0144 0.9931 0.9978 0.9957 1.0069 0.9905 0.9894 0.9902
dispcorr: -0.025699288 hartree
energy: -1117.891251209580
dipole: -24.32022 24.81300 0.49279 -7.52778 7.60285 0.07507 12.46756 -11.36019 1.10738
magnitude: 1.21440 au
magnitude: 3.08675 debye
