program: Orca
programVersion: 5.0.2
elementType: O O O C C C C C C C C C C C C C C C C C C C C C C C H H H H H H H H H H H H H H H H H H H H H H H H H H
charge: 0
multiplicity: 1
keywords: wb97x-d3
keywords: def2-TZVPP
keywords: def2/J RIJCOSX
keywords: DEFGRID2
keywords: scfconv7
keywords: smallprint printgap noloewdin
keywords: NOSOSCF
formula: C23H26O3
InChI: InChI=1/C23H26O3/c1-16(2)13-20-21(23(20,3)4)22(24)25-15-17-9-8-12-19(14-17)26-18-10-6-5-7-11-18/h5-14,20-21H,15H2,1-4H3
52 atoms
O  -1.662858 2.027172 0.396658
O  -0.667856 0.061284 0.770941
O  3.564158 0.873398 -1.562886
C  -3.16132 -1.138557 -0.669092
C  -3.518264 -1.114564 0.775742
C  -2.975682 0.15147 0.113836
C  -4.293125 -1.105809 -1.669047
C  -1.975055 -1.935877 -1.150885
C  -2.756833 -1.8740 1.799483
C  -1.651409 0.691338 0.462704
C  -2.600878 -1.500124 3.071427
C  -1.844227 -2.346331 4.048256
C  -3.127286 -0.210224 3.619838
C  -0.429198 2.723125 0.613267
C  0.477616 2.581703 -0.575546
C  1.633063 1.819159 -0.48668
C  0.134949 3.174572 -1.788633
C  2.419936 1.621614 -1.613842
C  0.941619 2.993005 -2.900391
C  2.081686 2.204008 -2.824856
C  3.553021 -0.321309 -0.895231
C  4.714956 -0.67898 -0.225299
C  2.454694 -1.174322 -0.912002
C  4.777198 -1.899421 0.432001
C  2.528994 -2.38679 -0.241781
C  3.684897 -2.755686 0.433476
H  -4.582531 -1.029257 0.982498
H  -3.71634 0.916522 -0.088076
H  -4.641687 -2.117293 -1.88863
H  -3.972944 -0.653611 -2.609988
H  -5.146789 -0.535686 -1.29992
H  -1.544926 -1.484908 -2.047549
H  -2.300162 -2.943781 -1.417762
H  -1.180943 -2.035615 -0.416051
H  -2.323658 -2.819057 1.483879
H  -0.996526 -1.796051 4.465629
H  -1.459814 -3.258796 3.592311
H  -2.473458 -2.631853 4.895531
H  -3.710386 -0.382076 4.528296
H  -3.758355 0.331879 2.917654
H  -2.303154 0.449909 3.905534
H  0.05521 2.380931 1.529393
H  -0.724757 3.761767 0.758122
H  1.905242 1.365515 0.458572
H  -0.761467 3.778198 -1.864652
H  0.677029 3.456291 -3.842057
H  2.702894 2.042759 -3.696906
H  5.56299 -0.0055 -0.22026
H  1.547866 -0.906447 -1.439677
H  5.684703 -2.174872 0.953814
H  1.67224 -3.048438 -0.253348
H  3.73354 -3.702878 0.954209
elementType: O C H
totalener: -1117.86575205 hartree
nucrepener: 2318.09938070 hartree
electener: -3435.96513275 hartree
oneelecener: -6126.66468590 hartree
twoeener: 2690.69955315 hartree
cpcmener: -0.02559000 hartree
kineticenergy: 1112.81615638 hartree
xcener: -110.228497125803 hartree
chargesum: -0.0000000
charge: -0.293078 -0.468712 -0.333999 0.143399 -0.022554 -0.115751 -0.266054 -0.300539 -0.270033 0.406653 -0.019868 -0.223042 -0.268323 0.086707 -0.000679 -0.165469 -0.237145 0.249793 -0.118463 -0.238091 0.285666 -0.244200 -0.194739 -0.127073 -0.150024 -0.182694 0.113345 0.092925 0.093176 0.095887 0.086118 0.101240 0.101739 0.085146 0.121058 0.093851 0.088273 0.094574 0.104737 0.093852 0.099333 0.112712 0.126948 0.140249 0.142115 0.157877 0.146449 0.144789 0.157478 0.157118 0.160179 0.157147
qa: -0.2931 -0.4687 -0.3340 0.1434 -0.0226 -0.1158 -0.2661 -0.3005 -0.2700 0.4067 -0.0199 -0.2230 -0.2683 0.0867 -0.0007 -0.1655 -0.2371 0.2498 -0.1185 -0.2381 0.2857 -0.2442 -0.1947 -0.1271 -0.1500 -0.1827 0.1133 0.0929 0.0932 0.0959 0.0861 0.1012 0.1017 0.0851 0.1211 0.0939 0.0883 0.0946 0.1047 0.0939 0.0993 0.1127 0.1269 0.1402 0.1421 0.1579 0.1464 0.1448 0.1575 0.1571 0.1602 0.1571
va: 2.1103 2.0152 2.0751 3.7222 3.8343 3.8184 3.9027 3.9117 3.8534 4.0865 3.7123 3.9267 3.9456 3.8187 3.6003 3.8894 3.9719 3.7459 3.8847 4.0213 3.7063 4.0015 3.8854 3.8916 3.8962 3.9096 1.0046 1.0312 1.0025 1.0021 1.0050 1.0001 0.9997 1.0095 1.0008 0.9964 1.0072 0.9970 0.9997 1.0052 0.9979 1.0092 0.9917 1.0167 1.0065 0.9887 1.0055 1.0083 0.9946 0.9891 0.9897 0.9908
dispcorr: -0.026548792 hartree
energy: -1117.892300844092
dipole: -21.39571 20.16159 -1.23412 -12.50103 12.82983 0.32880 9.89809 -9.79228 0.10581
magnitude: 1.28155 au
magnitude: 3.25743 debye
