program: Orca
programVersion: 5.0.2
elementType: O O O C C C C C C C C C C C C C C C C C C C C C C C H H H H H H H H H H H H H H H H H H H H H H H H H H
charge: 0
multiplicity: 1
keywords: wb97x-d3
keywords: def2-TZVPP
keywords: def2/J RIJCOSX
keywords: DEFGRID2
keywords: scfconv7
keywords: smallprint printgap noloewdin
keywords: NOSOSCF
formula: C23H26O3
InChI: InChI=1/C23H26O3/c1-16(2)13-20-21(23(20,3)4)22(24)25-15-17-9-8-12-19(14-17)26-18-10-6-5-7-11-18/h5-14,20-21H,15H2,1-4H3
52 atoms
O  -1.887222 1.495663 -1.619544
O  -0.950235 -0.462243 -1.087109
O  3.680708 1.285486 -0.570517
C  -3.949049 -0.970444 -0.118999
C  -3.10509 -0.755445 1.101388
C  -3.014075 0.225878 -0.062386
C  -5.419372 -0.646633 -0.006183
C  -3.672105 -2.121233 -1.053653
C  -2.036381 -1.68871 1.507921
C  -1.841554 0.341836 -0.949112
C  -1.796712 -2.076113 2.766425
C  -0.752939 -3.110752 3.064596
C  -2.548399 -1.584102 3.970678
C  -0.803273 1.813994 -2.503683
C  0.372652 2.341185 -1.733799
C  1.497503 1.552287 -1.538043
C  0.321653 3.618197 -1.179061
C  2.551221 2.031262 -0.770304
C  1.388414 4.094399 -0.4345
C  2.50575 3.299924 -0.215008
C  3.565141 -0.024782 -0.195917
C  4.559535 -0.890612 -0.631495
C  2.538545 -0.482755 0.622546
C  4.529321 -2.220561 -0.238853
C  2.517733 -1.817851 0.999059
C  3.508134 -2.692751 0.574511
H  -3.651374 -0.322421 1.932209
H  -3.512858 1.17344 0.107157
H  -5.839164 -0.378436 -0.978113
H  -5.603102 0.184226 0.676269
H  -5.974659 -1.510186 0.366405
H  -4.185293 -3.016433 -0.696483
H  -2.619488 -2.371511 -1.15799
H  -4.057781 -1.900401 -2.051066
H  -1.433169 -2.134217 0.727377
H  -0.277374 -3.494407 2.161799
H  -1.190024 -3.959798 3.598438
H  0.027227 -2.710366 3.717648
H  -3.392652 -2.240868 4.199367
H  -2.943086 -0.575119 3.857838
H  -1.906868 -1.585051 4.853814
H  -1.207238 2.57922 -3.165375
H  -0.531888 0.951205 -3.113809
H  1.54769 0.564018 -1.978458
H  -0.550136 4.242038 -1.33507
H  1.350428 5.088635 -0.008652
H  3.335708 3.662632 0.378321
H  5.353193 -0.521811 -1.269456
H  1.761293 0.184578 0.972744
H  5.307869 -2.891171 -0.579402
H  1.716619 -2.170464 1.636171
H  3.48428 -3.731836 0.875329
elementType: O C H
totalener: -1117.86599582 hartree
nucrepener: 2291.76808437 hartree
electener: -3409.63408019 hartree
oneelecener: -6073.83016070 hartree
twoeener: 2664.19608051 hartree
cpcmener: -0.02490430 hartree
kineticenergy: 1112.80390422 hartree
xcener: -110.226738854207 hartree
chargesum: 0.0000000
charge: -0.286156 -0.475433 -0.333398 0.104674 0.033660 -0.104496 -0.264875 -0.280541 -0.308691 0.410252 -0.018859 -0.242063 -0.282971 0.081183 -0.010760 -0.152185 -0.226811 0.237444 -0.123855 -0.231013 0.314011 -0.264973 -0.244317 -0.095588 -0.092242 -0.243103 0.111523 0.095358 0.093242 0.086079 0.095008 0.099839 0.093210 0.100685 0.118487 0.085332 0.110660 0.095084 0.106729 0.096235 0.094023 0.127980 0.114041 0.141006 0.143247 0.157653 0.147551 0.144867 0.147693 0.156555 0.186358 0.152663
qa: -0.2862 -0.4754 -0.3334 0.1047 0.0337 -0.1045 -0.2649 -0.2805 -0.3087 0.4103 -0.0189 -0.2421 -0.2830 0.0812 -0.0108 -0.1522 -0.2268 0.2374 -0.1239 -0.2310 0.3140 -0.2650 -0.2443 -0.0956 -0.0922 -0.2431 0.1115 0.0954 0.0932 0.0861 0.0950 0.0998 0.0932 0.1007 0.1185 0.0853 0.1107 0.0951 0.1067 0.0962 0.0940 0.1280 0.1140 0.1410 0.1432 0.1577 0.1476 0.1449 0.1477 0.1566 0.1864 0.1527
va: 2.1217 2.0156 2.0754 3.7301 3.7325 3.8384 3.9091 3.9063 3.8847 4.1207 3.6965 3.9268 3.9467 3.8124 3.6160 3.8859 3.9721 3.7595 3.8903 4.0194 3.6772 4.0132 3.9254 3.8697 3.8086 3.9589 1.0026 1.0293 1.0026 1.0057 1.0013 1.0002 1.0166 0.9999 1.0210 1.0071 0.9951 0.9925 0.9928 1.0048 1.0005 0.9928 1.0115 1.0195 1.0046 0.9889 1.0047 1.0087 1.0080 0.9888 0.9613 0.9963
dispcorr: -0.025533747 hartree
energy: -1117.891529566459
dipole: -23.38613 22.00406 -1.38207 -15.72935 16.05803 0.32868 13.02851 -12.73353 0.29498
magnitude: 1.45092 au
magnitude: 3.68794 debye
