program: Orca
programVersion: 5.0.2
elementType: O O O C C C C C C C C C C C C C C C C C C C C C C C H H H H H H H H H H H H H H H H H H H H H H H H H H
charge: 0
multiplicity: 1
keywords: wb97x-d3
keywords: def2-TZVPP
keywords: def2/J RIJCOSX
keywords: DEFGRID2
keywords: scfconv7
keywords: smallprint printgap noloewdin
keywords: NOSOSCF
formula: C23H26O3
InChI: InChI=1/C23H26O3/c1-16(2)13-20-21(23(20,3)4)22(24)25-15-17-9-8-12-19(14-17)26-18-10-6-5-7-11-18/h5-14,20-21H,15H2,1-4H3
52 atoms
O  -1.949581 1.200482 -1.81682
O  -1.350262 -0.862507 -1.204552
O  2.926412 0.567895 0.911261
C  -4.234016 -1.176913 -0.110199
C  -3.471885 -0.500987 0.974807
C  -3.431136 0.061001 -0.457065
C  -5.731609 -0.971802 -0.125143
C  -3.832157 -2.543487 -0.607547
C  -2.27383 -1.09271 1.614406
C  -2.152185 0.040397 -1.182748
C  -1.349282 -0.36983 2.251925
C  -0.163776 -1.006331 2.906083
C  -1.428787 1.129599 2.322727
C  -0.649429 1.441329 -2.373094
C  0.299581 1.88287 -1.294533
C  1.213144 0.988992 -0.745669
C  0.21869 3.181069 -0.798671
C  2.045568 1.402776 0.287397
C  1.049669 3.580234 0.237039
C  1.967696 2.697256 0.783448
C  3.480174 -0.494902 0.250032
C  4.056085 -0.356799 -1.00699
C  3.508581 -1.713056 0.912991
C  4.654563 -1.457725 -1.601464
C  4.122464 -2.802866 0.311785
C  4.691642 -2.6828 -0.948047
H  -4.062233 0.134128 1.631561
H  -4.010843 0.963475 -0.61172
H  -6.224991 -1.706366 0.514891
H  -6.133631 -1.087525 -1.1338
H  -6.012898 0.019576 0.23301
H  -2.767636 -2.747374 -0.541995
H  -4.129464 -2.672774 -1.650109
H  -4.350081 -3.308373 -0.024914
H  -2.159265 -2.171414 1.572795
H  -0.141071 -0.790779 3.977936
H  0.766827 -0.606687 2.494004
H  -0.152214 -2.088984 2.778599
H  -1.358637 1.583819 1.330599
H  -0.625492 1.548664 2.928587
H  -2.373437 1.469318 2.754087
H  -0.802111 2.236622 -3.101505
H  -0.278918 0.564469 -2.905076
H  1.264178 -0.024015 -1.12322
H  -0.490187 3.880642 -1.224867
H  0.990986 4.590559 0.620681
H  2.62076 3.006764 1.589868
H  4.042472 0.597071 -1.519497
H  3.058917 -1.804396 1.89406
H  5.100532 -1.352437 -2.582081
H  4.146732 -3.751706 0.832134
H  5.162823 -3.536581 -1.416974
elementType: O C H
totalener: -1117.86473821 hartree
nucrepener: 2350.50794391 hartree
electener: -3468.37268212 hartree
oneelecener: -6191.45291730 hartree
twoeener: 2723.08023518 hartree
cpcmener: -0.02455215 hartree
kineticenergy: 1112.80894819 hartree
xcener: -110.227903618456 hartree
chargesum: 0.0000000
charge: -0.290489 -0.463087 -0.330282 0.129814 -0.032222 -0.097549 -0.264019 -0.297280 -0.247936 0.379217 -0.013963 -0.208992 -0.288669 0.076284 -0.017235 -0.142471 -0.228857 0.279038 -0.104829 -0.272306 0.270373 -0.192014 -0.233923 -0.144374 -0.127876 -0.179933 0.111352 0.090323 0.094298 0.095478 0.085643 0.094325 0.099978 0.098052 0.120108 0.103464 0.072529 0.088520 0.081366 0.103254 0.112566 0.124050 0.113354 0.134949 0.138971 0.156097 0.143670 0.155487 0.153278 0.158696 0.157088 0.156686
qa: -0.2905 -0.4631 -0.3303 0.1298 -0.0322 -0.0975 -0.2640 -0.2973 -0.2479 0.3792 -0.0140 -0.2090 -0.2887 0.0763 -0.0172 -0.1425 -0.2289 0.2790 -0.1048 -0.2723 0.2704 -0.1920 -0.2339 -0.1444 -0.1279 -0.1799 0.1114 0.0903 0.0943 0.0955 0.0856 0.0943 0.1000 0.0981 0.1201 0.1035 0.0725 0.0885 0.0814 0.1033 0.1126 0.1240 0.1134 0.1349 0.1390 0.1561 0.1437 0.1555 0.1533 0.1587 0.1571 0.1567
va: 2.1080 2.0218 2.0472 3.7662 3.8181 3.8270 3.8972 3.8905 3.7998 4.1333 3.6634 3.9141 3.9639 3.8222 3.6369 3.8161 3.9397 3.6597 3.8755 4.0055 3.7257 3.9238 3.9832 3.8916 3.9048 3.9085 1.0056 1.0324 1.0023 1.0024 1.0048 1.0188 1.0004 0.9986 1.0016 0.9969 1.0003 1.0085 0.9979 1.0034 1.0036 0.9934 1.0126 1.0302 1.0052 0.9887 1.0088 0.9973 1.0006 0.9902 0.9908 0.9908
dispcorr: -0.028909868 hartree
energy: -1117.893648081332
dipole: -18.17739 17.72840 -0.44899 -6.47911 7.17799 0.69888 7.33196 -7.53932 -0.20737
magnitude: 0.85617 au
magnitude: 2.17622 debye
