program: Orca
programVersion: 5.0.2
elementType: O O O C C C C C C C C C C C C C C C C C C C C C C C H H H H H H H H H H H H H H H H H H H H H H H H H H
charge: 0
multiplicity: 1
keywords: wb97x-d3
keywords: def2-TZVPP
keywords: def2/J RIJCOSX
keywords: DEFGRID2
keywords: scfconv7
keywords: smallprint printgap noloewdin
keywords: NOSOSCF
formula: C23H26O3
InChI: InChI=1/C23H26O3/c1-16(2)13-20-21(23(20,3)4)22(24)25-15-17-9-8-12-19(14-17)26-18-10-6-5-7-11-18/h5-14,20-21H,15H2,1-4H3
52 atoms
O  -1.402177 2.331981 0.520191
O  -0.772467 0.218909 0.85677
O  3.689245 0.638585 -2.019781
C  -3.673564 -0.325035 -0.256214
C  -3.790818 -0.438099 1.23261
C  -3.102847 0.779304 0.618951
C  -4.921597 0.048238 -1.020445
C  -2.766586 -1.244974 -1.034133
C  -3.079399 -1.454778 2.030095
C  -1.652963 1.029708 0.693794
C  -3.567213 -2.098986 3.097001
C  -2.727976 -3.113343 3.816134
C  -4.929312 -1.898705 3.691034
C  -0.034192 2.725566 0.407043
C  0.59037 2.218437 -0.86338
C  1.852667 1.643772 -0.828068
C  -0.082344 2.334179 -2.077748
C  2.432333 1.17604 -2.001155
C  0.509681 1.870634 -3.241588
C  1.766637 1.282656 -3.211898
C  4.072407 -0.272139 -1.075695
C  3.188877 -1.173626 -0.492925
C  5.423335 -0.299581 -0.753333
C  3.670944 -2.09644 0.424879
C  5.890936 -1.234713 0.157857
C  5.018401 -2.134032 0.75556
H  -4.771153 -0.175942 1.614386
H  -3.692829 1.688329 0.637071
H  -5.501431 -0.843753 -1.267144
H  -4.671293 0.550033 -1.957634
H  -5.567629 0.715828 -0.448573
H  -1.883681 -1.569721 -0.490988
H  -2.428598 -0.76087 -1.952782
H  -3.319314 -2.141742 -1.321432
H  -2.072591 -1.707884 1.723264
H  -1.725689 -3.194449 3.395295
H  -3.189165 -4.104272 3.780024
H  -2.627928 -2.860141 4.875369
H  -5.41389 -2.862006 3.869333
H  -5.601921 -1.304784 3.075062
H  -4.855691 -1.408753 4.666247
H  0.537896 2.405565 1.280351
H  -0.0630 3.815527 0.413201
H  2.375445 1.554035 0.117207
H  -1.066149 2.78471 -2.120102
H  -0.013289 1.959374 -4.185028
H  2.227233 0.91135 -4.118696
H  2.1354 -1.166107 -0.742633
H  6.101703 0.405918 -1.217117
H  2.98062 -2.795933 0.878756
H  6.94462 -1.253134 0.405087
H  5.385265 -2.858546 1.470544
elementType: O C H
totalener: -1117.86705850 hartree
nucrepener: 2241.49956382 hartree
electener: -3359.36662233 hartree
oneelecener: -5973.08767458 hartree
twoeener: 2613.72105225 hartree
cpcmener: -0.02500927 hartree
kineticenergy: 1112.80158405 hartree
xcener: -110.228315182989 hartree
chargesum: 0.0000000
charge: -0.291389 -0.465154 -0.330002 0.099906 0.031965 -0.074869 -0.261938 -0.281729 -0.291863 0.378434 -0.051765 -0.219234 -0.260217 0.097671 0.046711 -0.216951 -0.261594 0.276949 -0.108118 -0.247309 0.297453 -0.192674 -0.257930 -0.150895 -0.118871 -0.190600 0.114605 0.094727 0.095012 0.093565 0.086641 0.096223 0.096588 0.100709 0.119473 0.087825 0.092844 0.091205 0.092779 0.089502 0.100283 0.114123 0.121540 0.142564 0.139859 0.156737 0.145707 0.153625 0.144671 0.159453 0.156891 0.156860
qa: -0.2914 -0.4652 -0.3300 0.0999 0.0320 -0.0749 -0.2619 -0.2817 -0.2919 0.3784 -0.0518 -0.2192 -0.2602 0.0977 0.0467 -0.2170 -0.2616 0.2769 -0.1081 -0.2473 0.2975 -0.1927 -0.2579 -0.1509 -0.1189 -0.1906 0.1146 0.0947 0.0950 0.0936 0.0866 0.0962 0.0966 0.1007 0.1195 0.0878 0.0928 0.0912 0.0928 0.0895 0.1003 0.1141 0.1215 0.1426 0.1399 0.1567 0.1457 0.1536 0.1447 0.1595 0.1569 0.1569
va: 2.1135 2.0250 2.0764 3.7223 3.7446 3.8253 3.9070 3.9111 3.8579 4.1319 3.7755 3.9242 3.9392 3.8058 3.6011 3.9488 3.9552 3.7173 3.8804 4.0231 3.6927 3.8914 4.0040 3.9003 3.8868 3.9089 1.0033 1.0304 1.0016 1.0026 1.0055 1.0110 1.0013 1.0015 1.0260 1.0094 0.9965 0.9956 0.9977 1.0122 0.9954 1.0109 0.9920 1.0067 1.0130 0.9892 1.0063 1.0016 1.0091 0.9906 0.9892 0.9908
dispcorr: -0.024150230 hartree
energy: -1117.891208734114
dipole: -27.58400 26.34435 -1.23965 -13.60897 13.98981 0.38083 11.39402 -11.21339 0.18063
magnitude: 1.30934 au
magnitude: 3.32809 debye
