program: Orca
programVersion: 5.0.2
elementType: O O O C C C C C C C C C C C C C C C C C C C C C C C H H H H H H H H H H H H H H H H H H H H H H H H H H
charge: 0
multiplicity: 1
keywords: wb97x-d3
keywords: def2-TZVPP
keywords: def2/J RIJCOSX
keywords: DEFGRID2
keywords: scfconv7
keywords: smallprint printgap noloewdin
keywords: NOSOSCF
formula: C23H26O3
InChI: InChI=1/C23H26O3/c1-16(2)13-20-21(23(20,3)4)22(24)25-15-17-9-8-12-19(14-17)26-18-10-6-5-7-11-18/h5-14,20-21H,15H2,1-4H3
52 atoms
O  -1.995615 1.135172 -0.234512
O  -1.629429 1.1782 1.964991
O  3.03069 0.866641 -0.27761
C  -3.422575 -1.545147 0.369679
C  -2.091609 -1.800552 -0.25796
C  -2.192005 -0.884912 0.96768
C  -4.008683 -2.659599 1.204004
C  -4.48154 -0.733492 -0.335091
C  -1.742279 -1.336702 -1.618649
C  -1.917501 0.562315 0.964034
C  -0.601838 -1.614073 -2.258382
C  -0.370358 -1.14042 -3.661177
C  0.532077 -2.390147 -1.660682
C  -1.619792 2.500459 -0.353903
C  -0.134161 2.708028 -0.227909
C  0.760216 1.653353 -0.348014
C  0.349049 3.995639 -0.010784
C  2.120297 1.883525 -0.184499
C  1.712076 4.219166 0.09417
C  2.609158 3.162234 0.026487
C  2.860735 -0.297731 0.415172
C  3.610536 -1.380291 -0.030916
C  2.034251 -0.427057 1.52649
C  3.521035 -2.596935 0.626068
C  1.949466 -1.656262 2.167762
C  2.684422 -2.746381 1.724578
H  -1.651145 -2.755804 0.0096
H  -1.859077 -1.332885 1.896965
H  -4.581833 -3.345692 0.57675
H  -4.681836 -2.267324 1.969152
H  -3.235165 -3.240982 1.707652
H  -4.098318 0.080073 -0.945264
H  -5.169791 -0.299283 0.393099
H  -5.067225 -1.383141 -0.989231
H  -2.490569 -0.764408 -2.155762
H  -0.112324 -1.970393 -4.324587
H  0.471077 -0.442758 -3.700294
H  -1.242698 -0.635679 -4.076893
H  0.572012 -3.403514 -2.070638
H  0.478932 -2.472391 -0.575867
H  1.486644 -1.922869 -1.909253
H  -2.153118 3.120107 0.370695
H  -1.960781 2.79491 -1.347357
H  0.412862 0.647866 -0.55493
H  -0.342557 4.824519 0.081039
H  2.082413 5.222708 0.257548
H  3.672714 3.327949 0.14131
H  4.256572 -1.267293 -0.89266
H  1.454885 0.405906 1.902557
H  4.107298 -3.434313 0.269852
H  1.301661 -1.752424 3.029933
H  2.610634 -3.699133 2.231652
elementType: O C H
totalener: -1117.86375346 hartree
nucrepener: 2403.93717156 hartree
electener: -3521.80092502 hartree
oneelecener: -6297.48634180 hartree
twoeener: 2775.68541678 hartree
cpcmener: -0.02531595 hartree
kineticenergy: 1112.80747514 hartree
xcener: -110.234663134764 hartree
chargesum: 0.0000000
charge: -0.275288 -0.461182 -0.326522 0.113214 0.010870 -0.102030 -0.263299 -0.290737 -0.266236 0.379416 0.000304 -0.231919 -0.294587 0.065128 0.044376 -0.185656 -0.228114 0.272044 -0.118182 -0.240762 0.349046 -0.301646 -0.207693 -0.107599 -0.160844 -0.184463 0.112916 0.095607 0.094201 0.095037 0.087061 0.093276 0.101360 0.101902 0.112403 0.098766 0.092711 0.087389 0.121013 0.069838 0.104882 0.119762 0.121560 0.095214 0.140794 0.157359 0.145004 0.143743 0.152132 0.155632 0.157548 0.155251
qa: -0.2753 -0.4612 -0.3265 0.1132 0.0109 -0.1020 -0.2633 -0.2907 -0.2662 0.3794 0.0003 -0.2319 -0.2946 0.0651 0.0444 -0.1857 -0.2281 0.2720 -0.1182 -0.2408 0.3490 -0.3016 -0.2077 -0.1076 -0.1608 -0.1845 0.1129 0.0956 0.0942 0.0950 0.0871 0.0933 0.1014 0.1019 0.1124 0.0988 0.0927 0.0874 0.1210 0.0698 0.1049 0.1198 0.1216 0.0952 0.1408 0.1574 0.1450 0.1437 0.1521 0.1556 0.1575 0.1553
va: 2.1080 2.0393 2.0866 3.8337 3.7139 3.8354 3.8955 3.9019 3.8491 4.1278 3.6997 3.9273 3.9585 3.8055 3.6281 3.8999 3.9682 3.7426 3.8848 4.0095 3.6140 3.9512 3.8587 3.8474 3.8744 3.8834 0.9971 1.0254 1.0021 1.0023 1.0050 1.0132 1.0006 0.9990 1.0090 0.9953 0.9958 1.0086 0.9970 1.0078 0.9865 1.0093 0.9935 1.0324 1.0007 0.9889 1.0064 1.0113 1.0067 0.9892 0.9926 0.9914
dispcorr: -0.030611949 hartree
energy: -1117.894365406535
dipole: -14.81507 14.08131 -0.73375 -15.24280 14.72469 -0.51811 -8.43244 7.50016 -0.93228
magnitude: 1.29460 au
magnitude: 3.29060 debye
