program: Orca
programVersion: 5.0.2
elementType: O O O C C C C C C C C C C C C C C C C C C C C C C C H H H H H H H H H H H H H H H H H H H H H H H H H H
charge: 0
multiplicity: 1
keywords: wb97x-d3
keywords: def2-TZVPP
keywords: def2/J RIJCOSX
keywords: DEFGRID2
keywords: scfconv7
keywords: smallprint printgap noloewdin
keywords: NOSOSCF
formula: C23H26O3
InChI: InChI=1/C23H26O3/c1-16(2)13-20-21(23(20,3)4)22(24)25-15-17-9-8-12-19(14-17)26-18-10-6-5-7-11-18/h5-14,20-21H,15H2,1-4H3
52 atoms
O  -2.396514 1.839911 -1.519041
O  -1.985081 -0.340429 -1.745086
O  3.247902 0.210341 -1.464082
C  -4.525666 -0.881065 -0.078231
C  -3.728248 -0.13383 0.952624
C  -3.883203 0.420209 -0.473646
C  -6.029031 -0.811159 0.068082
C  -4.063875 -2.21778 -0.607108
C  -2.412312 -0.582621 1.442967
C  -2.676853 0.549342 -1.313394
C  -1.91444 -0.391692 2.670533
C  -0.538002 -0.879191 3.013384
C  -2.617717 0.307608 3.793551
C  -1.141688 2.142789 -2.130825
C  0.013105 1.821585 -1.222072
C  1.10624 1.12183 -1.711963
C  -0.001905 2.2279 0.110118
C  2.190164 0.850561 -0.886089
C  1.079264 1.940983 0.928168
C  2.185783 1.258301 0.441138
C  4.052069 -0.607458 -0.71576
C  3.524623 -1.605528 0.094858
C  5.423867 -0.44761 -0.842549
C  4.387954 -2.441021 0.787791
C  6.276381 -1.299111 -0.152908
C  5.764058 -2.293302 0.668419
H  -4.322771 0.416649 1.672416
H  -4.54531 1.276534 -0.542562
H  -6.359249 0.155092 0.452806
H  -6.386565 -1.580852 0.755055
H  -6.521582 -0.969762 -0.893878
H  -2.987513 -2.357348 -0.607274
H  -4.416066 -2.370548 -1.628968
H  -4.494936 -3.010833 0.007291
H  -1.777217 -1.105507 0.736111
H  0.08502 -0.063669 3.39093
H  -0.027955 -1.3199 2.156395
H  -0.571949 -1.630674 3.807691
H  -2.107002 1.242077 4.043398
H  -2.595423 -0.3049 4.698927
H  -3.65914 0.547039 3.586978
H  -1.186023 3.21428 -2.328266
H  -1.040588 1.634163 -3.091734
H  1.121606 0.781582 -2.74095
H  -0.849483 2.768638 0.512205
H  1.071876 2.262808 1.961645
H  3.026176 1.057676 1.093137
H  2.452976 -1.735583 0.18364
H  5.819996 0.33299 -1.4801
H  3.978494 -3.218768 1.419571
H  7.346964 -1.176173 -0.255112
H  6.431278 -2.951945 1.208849
elementType: O C H
totalener: -1117.86618234 hartree
nucrepener: 2279.78098974 hartree
electener: -3397.64717208 hartree
oneelecener: -6049.69037188 hartree
twoeener: 2652.04319980 hartree
cpcmener: -0.02614229 hartree
kineticenergy: 1112.79903249 hartree
xcener: -110.227324410504 hartree
chargesum: 0.0000000
charge: -0.286640 -0.451649 -0.328667 0.117263 0.046501 -0.098511 -0.266639 -0.278728 -0.310923 0.369100 -0.052094 -0.228884 -0.258372 0.092847 0.060608 -0.255661 -0.265888 0.285644 -0.157714 -0.187176 0.258687 -0.178112 -0.228653 -0.154734 -0.131419 -0.173638 0.111733 0.099002 0.085934 0.095366 0.093884 0.093374 0.099965 0.092305 0.121333 0.087604 0.088340 0.109589 0.098905 0.095179 0.089175 0.122847 0.113839 0.129588 0.139997 0.160530 0.153971 0.161594 0.145778 0.158705 0.157183 0.157731
qa: -0.2866 -0.4516 -0.3287 0.1173 0.0465 -0.0985 -0.2666 -0.2787 -0.3109 0.3691 -0.0521 -0.2289 -0.2584 0.0928 0.0606 -0.2557 -0.2659 0.2856 -0.1577 -0.1872 0.2587 -0.1781 -0.2287 -0.1547 -0.1314 -0.1736 0.1117 0.0990 0.0859 0.0954 0.0939 0.0934 0.1000 0.0923 0.1213 0.0876 0.0883 0.1096 0.0989 0.0952 0.0892 0.1228 0.1138 0.1296 0.1400 0.1605 0.1540 0.1616 0.1458 0.1587 0.1572 0.1577
va: 2.1105 2.0513 2.0747 3.7214 3.7399 3.8204 3.9055 3.8940 3.8481 4.1797 3.7554 3.9215 3.9395 3.8003 3.6064 4.0734 3.9139 3.7319 3.8624 3.8793 3.7107 3.9097 4.0008 3.9001 3.8884 3.8972 1.0024 1.0277 1.0047 1.0021 1.0023 1.0132 1.0004 1.0015 1.0158 0.9955 1.0088 0.9985 0.9963 0.9972 1.0131 0.9923 1.0100 1.0206 1.0143 0.9892 0.9984 0.9936 1.0072 0.9909 0.9895 0.9903
dispcorr: -0.026367934 hartree
energy: -1117.892550271041
dipole: -20.36117 19.93596 -0.42521 -7.28473 7.88612 0.60139 16.87830 -15.62316 1.25514
magnitude: 1.45528 au
magnitude: 3.69903 debye
