program: Orca
programVersion: 5.0.2
elementType: O O O C C C C C C C C C C C C C C C C C C C C C C C H H H H H H H H H H H H H H H H H H H H H H H H H H
charge: 0
multiplicity: 1
keywords: wb97x-d3
keywords: def2-TZVPP
keywords: def2/J RIJCOSX
keywords: DEFGRID2
keywords: scfconv7
keywords: smallprint printgap noloewdin
keywords: NOSOSCF
formula: C23H26O3
InChI: InChI=1/C23H26O3/c1-16(2)13-20-21(23(20,3)4)22(24)25-15-17-9-8-12-19(14-17)26-18-10-6-5-7-11-18/h5-14,20-21H,15H2,1-4H3
52 atoms
O  -2.285391 1.795529 -1.255885
O  -2.250322 -0.413599 -1.60086
O  2.426335 -0.631992 -0.124436
C  -4.871004 -0.512173 0.056383
C  -3.768595 -0.548275 1.056656
C  -3.782712 0.540094 -0.026201
C  -6.208053 0.009389 0.529917
C  -5.010739 -1.591631 -0.988347
C  -2.745577 -1.622787 1.083908
C  -2.718537 0.549311 -1.041557
C  -1.531424 -1.506511 1.628743
C  -0.57704 -2.66055 1.660651
C  -1.017577 -0.238718 2.238151
C  -1.145288 1.988782 -2.105863
C  0.125476 1.903395 -1.308481
C  0.761305 0.682808 -1.110574
C  0.662671 3.05229 -0.73644
C  1.90782 0.61378 -0.331703
C  1.816618 2.974189 0.028526
C  2.445871 1.757504 0.24478
C  3.772846 -0.789165 0.071249
C  4.69597 -0.293267 -0.840988
C  4.185509 -1.515436 1.177722
C  6.046262 -0.532342 -0.634619
C  5.539802 -1.754874 1.367503
C  6.473843 -1.263159 0.466695
H  -4.01882 -0.140912 2.032639
H  -4.064834 1.526849 0.322179
H  -6.782912 0.428131 -0.298535
H  -6.100197 0.787591 1.286782
H  -6.799224 -0.797763 0.967674
H  -5.5178 -1.20208 -1.873233
H  -5.626431 -2.402022 -0.592094
H  -4.069095 -2.024088 -1.312867
H  -3.026313 -2.580941 0.656666
H  -0.999534 -3.557771 1.207988
H  -0.287013 -2.905071 2.686347
H  0.347146 -2.416783 1.128969
H  -0.025213 -0.000276 1.848657
H  -0.903263 -0.346287 3.320748
H  -1.661251 0.62036 2.056344
H  -1.268712 2.989069 -2.518669
H  -1.151435 1.280379 -2.93459
H  0.369618 -0.222681 -1.555666
H  0.181401 4.009797 -0.892881
H  2.232416 3.870104 0.470876
H  3.337161 1.710721 0.857502
H  4.366286 0.266388 -1.707828
H  3.452351 -1.894793 1.87888
H  6.767201 -0.149881 -1.345643
H  5.863078 -2.324661 2.229131
H  7.528719 -1.450103 0.618774
elementType: O C H
totalener: -1117.86604520 hartree
nucrepener: 2292.84330044 hartree
electener: -3410.70934564 hartree
oneelecener: -6076.00653778 hartree
twoeener: 2665.29719214 hartree
cpcmener: -0.02415513 hartree
kineticenergy: 1112.81654277 hartree
xcener: -110.228200126807 hartree
chargesum: -0.0000000
charge: -0.290973 -0.466909 -0.327685 0.138207 -0.028212 -0.111315 -0.264136 -0.301403 -0.252211 0.395922 -0.019089 -0.215219 -0.275045 0.079209 0.013627 -0.231403 -0.211347 0.230853 -0.141818 -0.167136 0.243787 -0.170108 -0.225785 -0.152911 -0.134936 -0.169417 0.112420 0.092425 0.095334 0.086424 0.094190 0.099661 0.098670 0.094625 0.120127 0.089380 0.094963 0.080169 0.086112 0.114816 0.094547 0.117445 0.115014 0.132646 0.142307 0.157677 0.154705 0.157707 0.149370 0.158481 0.158662 0.157577
qa: -0.2910 -0.4669 -0.3277 0.1382 -0.0282 -0.1113 -0.2641 -0.3014 -0.2522 0.3959 -0.0191 -0.2152 -0.2750 0.0792 0.0136 -0.2314 -0.2113 0.2309 -0.1418 -0.1671 0.2438 -0.1701 -0.2258 -0.1529 -0.1349 -0.1694 0.1124 0.0924 0.0953 0.0864 0.0942 0.0997 0.0987 0.0946 0.1201 0.0894 0.0950 0.0802 0.0861 0.1148 0.0945 0.1174 0.1150 0.1326 0.1423 0.1577 0.1547 0.1577 0.1494 0.1585 0.1587 0.1576
va: 2.1130 2.0197 2.0353 3.7427 3.8214 3.8361 3.8961 3.8929 3.8409 4.1174 3.6976 3.9219 3.9471 3.8082 3.6494 3.9551 3.9732 3.7099 3.9235 3.9086 3.7305 3.9304 3.9853 3.9051 3.8917 3.8921 1.0039 1.0314 1.0026 1.0046 1.0021 1.0005 0.9982 1.0181 1.0013 1.0096 0.9958 1.0085 0.9975 1.0000 1.0057 0.9963 1.0150 1.0372 1.0030 0.9905 0.9979 0.9962 1.0031 0.9904 0.9899 0.9904
dispcorr: -0.027266096 hartree
energy: -1117.893311296069
dipole: -17.41129 17.79182 0.38054 -6.20288 7.30655 1.10367 8.60971 -7.94356 0.66615
magnitude: 1.34411 au
magnitude: 3.41646 debye
