program: Orca
programVersion: 5.0.2
elementType: O O O C C C C C C C C C C C C C C C C C C C C C C C H H H H H H H H H H H H H H H H H H H H H H H H H H
charge: 0
multiplicity: 1
keywords: wb97x-d3
keywords: def2-TZVPP
keywords: def2/J RIJCOSX
keywords: DEFGRID2
keywords: scfconv7
keywords: smallprint printgap noloewdin
keywords: NOSOSCF
formula: C23H26O3
InChI: InChI=1/C23H26O3/c1-16(2)13-20-21(23(20,3)4)22(24)25-15-17-9-8-12-19(14-17)26-18-10-6-5-7-11-18/h5-14,20-21H,15H2,1-4H3
52 atoms
O  -1.479758 2.109332 0.932789
O  -2.178124 1.221564 -0.987793
O  3.344108 0.977476 -0.403756
C  -3.552067 -0.944109 0.777207
C  -2.148792 -1.457107 0.675633
C  -2.404454 -0.001881 1.074799
C  -4.351104 -1.369658 1.986294
C  -4.396818 -0.803465 -0.464518
C  -1.51719 -1.829253 -0.60779
C  -2.031828 1.131032 0.20785
C  -1.019508 -3.034499 -0.906939
C  -0.369033 -3.282457 -2.23446
C  -1.050076 -4.226136 0.00028
C  -0.977971 3.243047 0.225209
C  0.228155 2.906669 -0.607474
C  1.220523 2.082947 -0.086341
C  0.365811 3.431561 -1.8861
C  2.326591 1.764276 -0.861898
C  1.49472 3.136189 -2.637343
C  2.473135 2.291729 -2.138826
C  3.101942 -0.055755 0.4599
C  4.033438 -0.262225 1.468152
C  2.014945 -0.910117 0.315109
C  3.874804 -1.331844 2.338211
C  1.861322 -1.964813 1.20277
C  2.785286 -2.182529 2.215875
H  -1.827593 -2.050317 1.525194
H  -2.240482 0.200933 2.126756
H  -5.128256 -0.638727 2.219343
H  -3.724386 -1.481786 2.872022
H  -4.841373 -2.328357 1.804541
H  -5.139279 -0.012322 -0.343509
H  -4.939274 -1.735812 -0.633646
H  -3.830716 -0.592058 -1.366565
H  -1.45638 -1.064387 -1.37294
H  -0.402104 -2.406532 -2.882056
H  -0.848684 -4.11114 -2.762247
H  0.679854 -3.564978 -2.106565
H  -1.446074 -4.017685 0.992316
H  -0.050806 -4.65251 0.119125
H  -1.667696 -5.016536 -0.435564
H  -0.717736 3.95753 1.006604
H  -1.759344 3.695717 -0.388643
H  1.126096 1.688801 0.918356
H  -0.409853 4.065873 -2.297142
H  1.603352 3.547279 -3.632687
H  3.344326 2.041264 -2.73113
H  4.877724 0.40875 1.566114
H  1.291346 -0.763898 -0.477557
H  4.604662 -1.492147 3.121117
H  1.010084 -2.623437 1.092105
H  2.657636 -3.01055 2.900632
elementType: O C H
totalener: -1117.86675781 hartree
nucrepener: 2354.12134805 hartree
electener: -3471.98810586 hartree
oneelecener: -6198.06237329 hartree
twoeener: 2726.07426743 hartree
cpcmener: -0.02421372 hartree
kineticenergy: 1112.80929227 hartree
xcener: -110.232262188691 hartree
chargesum: 0.0000000
charge: -0.295859 -0.463372 -0.329485 0.143053 0.008608 -0.098716 -0.264670 -0.288086 -0.339404 0.385274 -0.018490 -0.233875 -0.268263 0.100766 0.045004 -0.257958 -0.235015 0.300101 -0.104593 -0.267205 0.312319 -0.269722 -0.245284 -0.091930 -0.065419 -0.251715 0.111060 0.096885 0.094944 0.087038 0.093701 0.102317 0.094755 0.098489 0.131246 0.091094 0.099706 0.092344 0.094618 0.092428 0.113019 0.120909 0.113767 0.138759 0.140822 0.156739 0.145344 0.144561 0.160868 0.156799 0.168718 0.153005
qa: -0.2959 -0.4634 -0.3295 0.1431 0.0086 -0.0987 -0.2647 -0.2881 -0.3394 0.3853 -0.0185 -0.2339 -0.2683 0.1008 0.0450 -0.2580 -0.2350 0.3001 -0.1046 -0.2672 0.3123 -0.2697 -0.2453 -0.0919 -0.0654 -0.2517 0.1111 0.0969 0.0949 0.0870 0.0937 0.1023 0.0948 0.0985 0.1312 0.0911 0.0997 0.0923 0.0946 0.0924 0.1130 0.1209 0.1138 0.1388 0.1408 0.1567 0.1453 0.1446 0.1609 0.1568 0.1687 0.1530
va: 2.1132 2.0274 2.0878 3.7536 3.7285 3.9214 3.9037 3.9044 3.8018 4.0962 3.7063 3.9188 3.9255 3.8081 3.6143 3.9269 3.9772 3.7084 3.8887 4.0168 3.7310 4.0246 3.9366 3.8594 3.7776 4.0007 1.0037 1.0285 1.0023 1.0050 1.0024 1.0004 1.0017 1.0146 1.0202 1.0079 0.9979 0.9960 1.0095 0.9956 0.9974 0.9925 1.0092 1.0185 1.0038 0.9890 1.0073 1.0086 0.9944 0.9885 0.9711 0.9964
dispcorr: -0.028090600 hartree
energy: -1117.894848405104
dipole: -17.99148 17.58307 -0.40841 -20.72662 20.23175 -0.49487 0.79698 0.27322 1.07020
magnitude: 1.24781 au
magnitude: 3.17168 debye
