program: Orca
programVersion: 5.0.2
elementType: O O O C C C C C C C C C C C C C C C C C C C C C C C H H H H H H H H H H H H H H H H H H H H H H H H H H
charge: 0
multiplicity: 1
keywords: wb97x-d3
keywords: def2-TZVPP
keywords: def2/J RIJCOSX
keywords: DEFGRID2
keywords: scfconv7
keywords: smallprint printgap noloewdin
keywords: NOSOSCF
formula: C23H26O3
InChI: InChI=1/C23H26O3/c1-16(2)13-20-21(23(20,3)4)22(24)25-15-17-9-8-12-19(14-17)26-18-10-6-5-7-11-18/h5-14,20-21H,15H2,1-4H3
52 atoms
O  -1.809318 0.663791 -1.965425
O  -1.737347 -1.256085 -0.832251
O  3.364345 -0.516906 0.712197
C  -4.668974 -0.749481 -0.006968
C  -4.036398 0.438944 0.65941
C  -3.724785 0.104344 -0.808643
C  -6.123542 -0.60195 -0.392035
C  -4.331365 -2.156098 0.425761
C  -2.997418 0.322727 1.698576
C  -2.348334 -0.275198 -1.180023
C  -2.832418 1.126016 2.756498
C  -1.709683 0.883801 3.721223
C  -3.692133 2.304137 3.098077
C  -0.411363 0.56202 -2.234558
C  0.412656 0.817301 -1.001696
C  1.520695 0.02463 -0.736322
C  0.0775 1.84873 -0.127204
C  2.297396 0.275755 0.388651
C  0.848405 2.075157 1.00184
C  1.967184 1.296784 1.265287
C  4.282311 -0.852516 -0.243579
C  4.691451 0.038912 -1.228739
C  4.846621 -2.118186 -0.157146
C  5.666894 -0.353965 -2.134296
C  5.827734 -2.492743 -1.063532
C  6.238996 -1.616701 -2.058727
H  -4.684059 1.303279 0.752471
H  -4.185845 0.783156 -1.517823
H  -6.772458 -0.846807 0.451239
H  -6.378584 -1.274908 -1.213522
H  -6.363223 0.413833 -0.710408
H  -3.32968 -2.278164 0.825591
H  -4.440916 -2.85226 -0.407881
H  -5.032447 -2.467106 1.203039
H  -2.288653 -0.491413 1.593965
H  -2.090877 0.674979 4.724913
H  -1.07312 1.768007 3.813779
H  -1.078843 0.046936 3.42123
H  -3.092492 3.217446 3.136884
H  -4.128454 2.183421 4.093281
H  -4.510152 2.47613 2.401661
H  -0.220908 1.327716 -2.987351
H  -0.164503 -0.404592 -2.678575
H  1.76776 -0.79594 -1.400256
H  -0.784861 2.474799 -0.318494
H  0.584764 2.874234 1.682572
H  2.574321 1.47606 2.143638
H  4.263818 1.031804 -1.292359
H  4.521261 -2.801513 0.617576
H  5.985263 0.341109 -2.900871
H  6.267313 -3.47945 -0.992374
H  7.000824 -1.913708 -2.767387
elementType: O C H
totalener: -1117.86623204 hartree
nucrepener: 2257.64509394 hartree
electener: -3375.51132598 hartree
oneelecener: -6005.42953183 hartree
twoeener: 2629.91820585 hartree
cpcmener: -0.02630269 hartree
kineticenergy: 1112.79837463 hartree
xcener: -110.227381530422 hartree
chargesum: -0.0000000
charge: -0.288149 -0.450105 -0.330809 0.119285 0.045650 -0.098319 -0.267090 -0.278793 -0.311426 0.367316 -0.053457 -0.229094 -0.254319 0.093557 0.055184 -0.187704 -0.258791 0.247613 -0.140751 -0.227249 0.270135 -0.176891 -0.244656 -0.152229 -0.124075 -0.185538 0.112528 0.099679 0.095179 0.093869 0.086114 0.094135 0.099719 0.092506 0.120908 0.107477 0.086909 0.090831 0.095424 0.096834 0.088433 0.121795 0.114197 0.142944 0.141960 0.159744 0.146428 0.154088 0.146053 0.158613 0.157135 0.157203
qa: -0.2881 -0.4501 -0.3308 0.1193 0.0456 -0.0983 -0.2671 -0.2788 -0.3114 0.3673 -0.0535 -0.2291 -0.2543 0.0936 0.0552 -0.1877 -0.2588 0.2476 -0.1408 -0.2272 0.2701 -0.1769 -0.2447 -0.1522 -0.1241 -0.1855 0.1125 0.0997 0.0952 0.0939 0.0861 0.0941 0.0997 0.0925 0.1209 0.1075 0.0869 0.0908 0.0954 0.0968 0.0884 0.1218 0.1142 0.1429 0.1420 0.1597 0.1464 0.1541 0.1461 0.1586 0.1571 0.1572
va: 2.1096 2.0520 2.0681 3.7200 3.7407 3.8240 3.9059 3.8952 3.8453 4.1736 3.7657 3.9180 3.9396 3.8064 3.5865 3.9612 3.9116 3.7414 3.8608 3.9993 3.7089 3.8882 4.0006 3.8989 3.8905 3.9011 1.0022 1.0276 1.0021 1.0022 1.0048 1.0133 1.0007 1.0013 1.0177 0.9985 0.9964 1.0085 0.9973 0.9969 1.0137 0.9922 1.0104 1.0072 1.0134 0.9871 1.0054 0.9987 1.0082 0.9906 0.9892 0.9906
dispcorr: -0.025853706 hartree
energy: -1117.892085746990
dipole: -25.30930 24.76090 -0.54841 2.88407 -1.69637 1.18771 11.05284 -11.50489 -0.45206
magnitude: 1.38411 au
magnitude: 3.51812 debye
