program: Orca
programVersion: 5.0.2
elementType: O O O C C C C C C C C C C C C C C C C C C C C C C C H H H H H H H H H H H H H H H H H H H H H H H H H H
charge: 0
multiplicity: 1
keywords: wb97x-d3
keywords: def2-TZVPP
keywords: def2/J RIJCOSX
keywords: DEFGRID2
keywords: scfconv7
keywords: smallprint printgap noloewdin
keywords: NOSOSCF
formula: C23H26O3
InChI: InChI=1/C23H26O3/c1-16(2)13-20-21(23(20,3)4)22(24)25-15-17-9-8-12-19(14-17)26-18-10-6-5-7-11-18/h5-14,20-21H,15H2,1-4H3
52 atoms
O  -1.769507 2.267599 -0.313635
O  -1.104817 0.56955 0.970095
O  3.979879 0.925896 -0.831644
C  -3.693678 -0.808887 -0.143437
C  -4.146301 -0.166824 1.131587
C  -3.35376 0.649206 0.110035
C  -4.740167 -1.037122 -1.208434
C  -2.629708 -1.877302 -0.134692
C  -3.617058 -0.534088 2.458641
C  -1.972356 1.112257 0.328307
C  -4.343852 -0.724588 3.56648
C  -3.677561 -1.109115 4.854409
C  -5.833328 -0.593107 3.665807
C  -0.456525 2.823573 -0.27085
C  0.526056 2.030787 -1.086541
C  1.799007 1.788914 -0.585278
C  0.182676 1.551109 -2.346774
C  2.721769 1.088385 -1.346759
C  1.110288 0.839078 -3.092806
C  2.386806 0.604931 -2.604127
C  4.53374 -0.324236 -0.804697
C  5.904981 -0.412495 -1.003329
C  3.781916 -1.462828 -0.538944
C  6.527175 -1.650375 -0.930389
C  4.417574 -2.694894 -0.477539
C  5.788221 -2.7970 -0.672746
H  -5.191659 0.121172 1.129466
H  -3.952195 1.355842 -0.452965
H  -5.246131 -1.992372 -1.053264
H  -4.287803 -1.059162 -2.202316
H  -5.500949 -0.255218 -1.206795
H  -2.08617 -1.885708 -1.081691
H  -3.103866 -2.854591 -0.02267
H  -1.899095 -1.779632 0.663229
H  -2.546224 -0.671701 2.54348
H  -3.904012 -0.388013 5.644641
H  -2.593652 -1.170909 4.757495
H  -4.038888 -2.077777 5.210898
H  -6.104663 0.172542 4.397223
H  -6.274974 -1.526387 4.024695
H  -6.323883 -0.341536 2.728031
H  -0.111841 2.931753 0.759683
H  -0.572556 3.826038 -0.684537
H  2.075231 2.141672 0.401693
H  -0.805486 1.7295 -2.752011
H  0.841252 0.46793 -4.07326
H  3.108656 0.057052 -3.197032
H  6.47852 0.482702 -1.20934
H  2.71377 -1.397233 -0.372778
H  7.596563 -1.716136 -1.08467
H  3.831521 -3.580749 -0.26888
H  6.276263 -3.761338 -0.622071
elementType: O C H
totalener: -1117.86738143 hartree
nucrepener: 2197.59424118 hartree
electener: -3315.46162261 hartree
oneelecener: -5885.24067436 hartree
twoeener: 2569.77905175 hartree
cpcmener: -0.02540791 hartree
kineticenergy: 1112.80401966 hartree
xcener: -110.227711914981 hartree
chargesum: -0.0000000
charge: -0.294945 -0.466869 -0.333107 0.104845 0.024790 -0.085389 -0.262247 -0.281193 -0.288901 0.390128 -0.055929 -0.218363 -0.254765 0.104381 0.037381 -0.238577 -0.239531 0.233755 -0.129900 -0.179004 0.252649 -0.233079 -0.163341 -0.130495 -0.162276 -0.178948 0.115979 0.094222 0.094395 0.093587 0.086465 0.099119 0.097833 0.096006 0.122395 0.091389 0.088294 0.091919 0.096269 0.094831 0.087853 0.114244 0.120613 0.131490 0.140531 0.158333 0.158104 0.145679 0.156539 0.156648 0.159011 0.157183
qa: -0.2949 -0.4669 -0.3331 0.1048 0.0248 -0.0854 -0.2622 -0.2812 -0.2889 0.3901 -0.0559 -0.2184 -0.2548 0.1044 0.0374 -0.2386 -0.2395 0.2338 -0.1299 -0.1790 0.2526 -0.2331 -0.1633 -0.1305 -0.1623 -0.1789 0.1160 0.0942 0.0944 0.0936 0.0865 0.0991 0.0978 0.0960 0.1224 0.0914 0.0883 0.0919 0.0963 0.0948 0.0879 0.1142 0.1206 0.1315 0.1405 0.1583 0.1581 0.1457 0.1565 0.1566 0.1590 0.1572
va: 2.1155 2.0265 2.0600 3.7096 3.7543 3.8535 3.9098 3.9096 3.8529 4.1061 3.7861 3.9231 3.9393 3.7958 3.6241 4.0603 3.9534 3.7657 3.8941 3.9304 3.7164 3.9922 3.8717 3.8975 3.9071 3.8950 1.0028 1.0305 1.0019 1.0024 1.0053 1.0003 1.0012 1.0138 1.0254 0.9963 1.0092 0.9965 0.9967 0.9972 1.0138 1.0108 0.9916 1.0175 1.0134 0.9902 0.9951 1.0079 0.9989 0.9894 0.9909 0.9904
dispcorr: -0.023347726 hartree
energy: -1117.890729158461
dipole: -29.67999 28.49270 -1.18729 -12.47177 12.33735 -0.13442 11.53504 -12.19826 -0.66322
magnitude: 1.36659 au
magnitude: 3.47361 debye
