program: Orca
programVersion: 5.0.2
elementType: O O O C C C C C C C C C C C C C C C C C C C C C C C H H H H H H H H H H H H H H H H H H H H H H H H H H
charge: 0
multiplicity: 1
keywords: wb97x-d3
keywords: def2-TZVPP
keywords: def2/J RIJCOSX
keywords: DEFGRID2
keywords: scfconv7
keywords: smallprint printgap noloewdin
keywords: NOSOSCF
formula: C23H26O3
InChI: InChI=1/C23H26O3/c1-16(2)13-20-21(23(20,3)4)22(24)25-15-17-9-8-12-19(14-17)26-18-10-6-5-7-11-18/h5-14,20-21H,15H2,1-4H3
52 atoms
O  -1.774282 2.293708 -0.312489
O  -1.078921 0.607013 0.968328
O  3.950029 0.91147 -0.784489
C  -3.632795 -0.826814 -0.137724
C  -4.106329 -0.184455 1.12906
C  -3.327314 0.640939 0.105165
C  -4.668713 -1.092125 -1.204243
C  -2.544475 -1.87004 -0.109821
C  -3.574489 -0.526944 2.462078
C  -1.956708 1.134033 0.327089
C  -4.307217 -0.778506 3.553361
C  -3.640939 -1.112561 4.854905
C  -5.804675 -0.755244 3.619026
C  -0.468447 2.868991 -0.267076
C  0.523798 2.08877 -1.083068
C  1.779552 1.806362 -0.560363
C  0.201204 1.654871 -2.365219
C  2.707187 1.112743 -1.322493
C  1.132834 0.949461 -3.112306
C  2.393138 0.67614 -2.602117
C  4.485131 -0.347009 -0.785363
C  5.860088 -0.448247 -0.950199
C  3.711699 -1.483296 -0.577814
C  6.463811 -1.696436 -0.901897
C  4.329338 -2.725642 -0.540574
C  5.703321 -2.84066 -0.702425
H  -5.157559 0.081278 1.120483
H  -3.938061 1.3304 -0.465922
H  -5.151804 -2.057351 -1.038197
H  -4.212545 -1.116605 -2.1963
H  -5.448714 -0.329418 -1.215478
H  -1.986319 -1.869382 -1.048311
H  -2.997501 -2.85756 -0.000711
H  -1.829247 -1.752022 0.699038
H  -2.498166 -0.585306 2.566475
H  -3.942834 -0.415108 5.641348
H  -2.553688 -1.085684 4.781904
H  -3.930395 -2.108725 5.201042
H  -6.180417 -1.677733 4.071587
H  -6.2922 -0.645644 2.650705
H  -6.151772 0.062891 4.259061
H  -0.126946 2.979841 0.764092
H  -0.598112 3.870133 -0.679492
H  2.038721 2.122396 0.443536
H  -0.773821 1.865493 -2.78671
H  0.880584 0.615343 -4.110381
H  3.119063 0.135035 -3.196273
H  6.451048 0.444992 -1.110505
H  2.640343 -1.408488 -0.438011
H  7.536143 -1.77193 -1.029418
H  3.726254 -3.609557 -0.376939
H  6.177258 -3.812868 -0.670605
elementType: O C H
totalener: -1117.86724660 hartree
nucrepener: 2200.90484028 hartree
electener: -3318.77208688 hartree
oneelecener: -5891.88200724 hartree
twoeener: 2573.10992036 hartree
cpcmener: -0.02519926 hartree
kineticenergy: 1112.79792689 hartree
xcener: -110.226233439826 hartree
chargesum: 0.0000000
charge: -0.294807 -0.467993 -0.333000 0.108866 0.029998 -0.093679 -0.262322 -0.282873 -0.298656 0.393441 -0.042603 -0.220849 -0.258994 0.103183 0.035486 -0.235782 -0.239420 0.232931 -0.130184 -0.178388 0.253709 -0.233727 -0.164125 -0.130195 -0.162182 -0.178960 0.112757 0.094240 0.094351 0.093560 0.086548 0.099833 0.097522 0.096613 0.123481 0.091290 0.088389 0.092540 0.093113 0.088743 0.099009 0.114184 0.121340 0.131689 0.140591 0.158206 0.158342 0.145414 0.156821 0.156553 0.158792 0.157201
qa: -0.2948 -0.4680 -0.3330 0.1089 0.0300 -0.0937 -0.2623 -0.2829 -0.2987 0.3934 -0.0426 -0.2208 -0.2590 0.1032 0.0355 -0.2358 -0.2394 0.2329 -0.1302 -0.1784 0.2537 -0.2337 -0.1641 -0.1302 -0.1622 -0.1790 0.1128 0.0942 0.0944 0.0936 0.0865 0.0998 0.0975 0.0966 0.1235 0.0913 0.0884 0.0925 0.0931 0.0887 0.0990 0.1142 0.1213 0.1317 0.1406 0.1582 0.1583 0.1454 0.1568 0.1566 0.1588 0.1572
va: 2.1167 2.0253 2.0602 3.7078 3.7534 3.8742 3.9101 3.9103 3.8636 4.1008 3.7672 3.9250 3.9409 3.7959 3.6241 4.0550 3.9545 3.7668 3.8935 3.9304 3.7156 3.9922 3.8721 3.8968 3.9071 3.8952 1.0050 1.0301 1.0018 1.0023 1.0052 1.0002 1.0015 1.0135 1.0253 0.9957 1.0090 0.9968 0.9976 1.0115 0.9958 1.0107 0.9917 1.0176 1.0129 0.9903 0.9949 1.0080 0.9989 0.9894 0.9910 0.9904
dispcorr: -0.023394156 hartree
energy: -1117.890640760035
dipole: -29.34057 28.15485 -1.18572 -12.85051 12.70883 -0.14168 11.39556 -12.08104 -0.68548
magnitude: 1.37692 au
magnitude: 3.49984 debye
