program: Orca
programVersion: 5.0.2
elementType: O O O C C C C C C C C C C C C C C C C C C C C C C C H H H H H H H H H H H H H H H H H H H H H H H H H H
charge: 0
multiplicity: 1
keywords: wb97x-d3
keywords: def2-TZVPP
keywords: def2/J RIJCOSX
keywords: DEFGRID2
keywords: scfconv7
keywords: smallprint printgap noloewdin
keywords: NOSOSCF
formula: C23H26O3
InChI: InChI=1/C23H26O3/c1-16(2)13-20-21(23(20,3)4)22(24)25-15-17-9-8-12-19(14-17)26-18-10-6-5-7-11-18/h5-14,20-21H,15H2,1-4H3
52 atoms
O  -1.744362 1.808528 -1.067705
O  -1.503796 -0.334293 -1.66461
O  3.550072 1.214828 -0.596797
C  -3.783351 -0.8119 0.419964
C  -2.518741 -0.987151 1.200253
C  -2.703191 0.252191 0.334485
C  -5.021185 -0.407392 1.182968
C  -4.075601 -1.722313 -0.745425
C  -1.525899 -2.048923 0.902234
C  -1.926474 0.496548 -0.895419
C  -1.402299 -3.177988 1.606218
C  -0.359151 -4.195256 1.258814
C  -2.265203 -3.538069 2.77634
C  -0.97959 2.276188 -2.187346
C  0.390211 2.691442 -1.733966
C  1.328369 1.72666 -1.377368
C  0.722014 4.038615 -1.648776
C  2.577896 2.119039 -0.91957
C  1.982841 4.418819 -1.211038
C  2.913007 3.464251 -0.833403
C  3.241881 0.08085 0.103195
C  2.291018 0.061344 1.117069
C  3.974932 -1.058821 -0.199305
C  2.075832 -1.114217 1.822001
C  3.756809 -2.223337 0.521764
C  2.805299 -2.259228 1.531456
H  -2.61144 -0.750305 2.255978
H  -2.915169 1.159887 0.887162
H  -4.787163 0.238515 2.030108
H  -5.536473 -1.288776 1.570999
H  -5.72235 0.128698 0.539911
H  -4.695991 -1.217767 -1.488473
H  -4.632461 -2.591991 -0.391701
H  -3.186054 -2.091166 -1.247701
H  -0.854712 -1.898045 0.065544
H  -0.818158 -5.157033 1.015498
H  0.308168 -4.379726 2.10449
H  0.2504 -3.890388 0.408767
H  -2.721363 -4.519615 2.627433
H  -3.069379 -2.82848 2.960136
H  -1.669616 -3.613768 3.689549
H  -1.526038 3.130595 -2.584997
H  -0.927294 1.516924 -2.967062
H  1.085874 0.674228 -1.465566
H  -0.004821 4.791779 -1.926876
H  2.240146 5.468226 -1.149922
H  3.894513 3.754122 -0.479633
H  1.723922 0.949666 1.365139
H  4.715002 -1.02796 -0.98918
H  1.335306 -1.127263 2.610963
H  4.333315 -3.108563 0.28641
H  2.636182 -3.17029 2.089621
elementType: O C H
totalener: -1117.86565225 hartree
nucrepener: 2312.11423222 hartree
electener: -3429.97988447 hartree
oneelecener: -6114.15034060 hartree
twoeener: 2684.17045612 hartree
cpcmener: -0.02363766 hartree
kineticenergy: 1112.81755175 hartree
xcener: -110.230492835144 hartree
chargesum: -0.0000000
charge: -0.289635 -0.476699 -0.329692 0.154752 -0.016862 -0.111551 -0.270314 -0.289901 -0.306511 0.406289 0.000218 -0.263168 -0.260668 0.081614 -0.015476 -0.163342 -0.221355 0.252428 -0.110561 -0.249032 0.305526 -0.193578 -0.261166 -0.152164 -0.106224 -0.203658 0.112163 0.095888 0.087817 0.092466 0.096322 0.102972 0.095817 0.099259 0.131436 0.108835 0.093710 0.092544 0.095940 0.086667 0.099158 0.111824 0.117823 0.149263 0.142315 0.157582 0.145694 0.152946 0.144153 0.158626 0.157447 0.162061
qa: -0.2896 -0.4767 -0.3297 0.1548 -0.0169 -0.1116 -0.2703 -0.2899 -0.3065 0.4063 0.0002 -0.2632 -0.2607 0.0816 -0.0155 -0.1633 -0.2214 0.2524 -0.1106 -0.2490 0.3055 -0.1936 -0.2612 -0.1522 -0.1062 -0.2037 0.1122 0.0959 0.0878 0.0925 0.0963 0.1030 0.0958 0.0993 0.1314 0.1088 0.0937 0.0925 0.0959 0.0867 0.0992 0.1118 0.1178 0.1493 0.1423 0.1576 0.1457 0.1529 0.1442 0.1586 0.1574 0.1621
va: 2.1284 2.0074 2.0790 3.6915 3.7820 3.9586 3.9014 3.9022 3.8364 4.0880 3.6392 3.9377 3.9517 3.8088 3.7146 3.8841 3.9735 3.7663 3.8918 4.0178 3.6725 3.8855 4.0223 3.8503 3.8877 3.8834 1.0007 1.0292 1.0049 1.0030 1.0024 1.0005 1.0012 1.0143 1.0159 1.0002 0.9925 1.0043 0.9979 1.0077 0.9975 1.0001 1.0197 1.0178 1.0039 0.9888 1.0066 0.9994 1.0091 0.9915 0.9893 0.9861
dispcorr: -0.027086957 hartree
energy: -1117.892739204968
dipole: -21.68469 20.76973 -0.91496 -19.44743 19.81408 0.36665 11.38660 -10.49956 0.88703
magnitude: 1.32605 au
magnitude: 3.37055 debye
