program: Orca
programVersion: 5.0.2
elementType: O O O C C C C C C C C C C C C C C C C C C C C C C C H H H H H H H H H H H H H H H H H H H H H H H H H H
charge: 0
multiplicity: 1
keywords: wb97x-d3
keywords: def2-TZVPP
keywords: def2/J RIJCOSX
keywords: DEFGRID2
keywords: scfconv7
keywords: smallprint printgap noloewdin
keywords: NOSOSCF
formula: C23H26O3
InChI: InChI=1/C23H26O3/c1-16(2)13-20-21(23(20,3)4)22(24)25-15-17-9-8-12-19(14-17)26-18-10-6-5-7-11-18/h5-14,20-21H,15H2,1-4H3
52 atoms
O  -1.793518 0.474109 -1.801598
O  -1.597436 -1.154829 -0.292171
O  3.698744 -0.166896 0.45543
C  -4.660133 -0.907068 0.109969
C  -4.167175 0.268831 0.897141
C  -3.673993 0.039127 -0.537889
C  -6.066085 -0.816449 -0.436514
C  -4.280526 -2.313231 0.505332
C  -3.267449 0.146111 2.058971
C  -2.270892 -0.306749 -0.826698
C  -3.396823 0.786722 3.226663
C  -2.39216 0.576483 4.320245
C  -4.497313 1.740681 3.578783
C  -0.422041 0.310929 -2.157511
C  0.517198 0.79494 -1.087235
C  1.670998 0.072773 -0.815698
C  0.261694 1.972838 -0.388993
C  2.573415 0.541034 0.13146
C  1.157178 2.414686 0.571597
C  2.323364 1.708878 0.83313
C  4.529344 -0.621525 -0.529379
C  5.221223 -1.797662 -0.269787
C  4.733602 0.0702 -1.717585
C  6.121412 -2.282941 -1.206423
C  5.630328 -0.433908 -2.649271
C  6.327003 -1.608624 -2.402373
H  -4.865359 1.096829 0.947193
H  -4.099908 0.723962 -1.262032
H  -6.328886 0.20205 -0.726111
H  -6.791214 -1.146227 0.310385
H  -6.184261 -1.452485 -1.316501
H  -3.338047 -2.38963 1.03875
H  -4.220245 -2.961408 -0.371041
H  -5.055597 -2.72006 1.158115
H  -2.421101 -0.522986 1.958214
H  -2.865174 0.171031 5.218922
H  -1.930998 1.522908 4.616049
H  -1.595049 -0.104987 4.022995
H  -5.000382 1.419272 4.4945
H  -5.259726 1.846376 2.809665
H  -4.093643 2.73534 3.786349
H  -0.303368 0.909934 -3.061266
H  -0.209566 -0.727018 -2.422897
H  1.861054 -0.857734 -1.338794
H  -0.63396 2.547909 -0.587749
H  0.954646 3.327212 1.117258
H  3.02867 2.057701 1.576839
H  5.056393 -2.325602 0.661329
H  4.209664 0.995486 -1.921503
H  6.658969 -3.199428 -0.999352
H  5.787324 0.106406 -3.574069
H  7.02541 -1.993273 -3.133812
elementType: O C H
totalener: -1117.86733685 hartree
nucrepener: 2212.32290448 hartree
electener: -3330.19024132 hartree
oneelecener: -5914.77093944 hartree
twoeener: 2584.58069812 hartree
cpcmener: -0.02607834 hartree
kineticenergy: 1112.80357697 hartree
xcener: -110.228239424079 hartree
chargesum: 0.0000000
charge: -0.295560 -0.461692 -0.330564 0.115475 0.037311 -0.100878 -0.262741 -0.284141 -0.304972 0.388289 -0.043967 -0.219873 -0.256213 0.102847 0.045110 -0.193348 -0.251290 0.244082 -0.117837 -0.236540 0.280614 -0.248720 -0.182035 -0.121932 -0.154287 -0.188682 0.111599 0.096512 0.086475 0.093928 0.093611 0.097366 0.101646 0.093928 0.122348 0.093072 0.091292 0.088348 0.095134 0.088066 0.097384 0.120861 0.113391 0.142595 0.139783 0.156572 0.146146 0.145529 0.153340 0.156793 0.158570 0.157259
qa: -0.2956 -0.4617 -0.3306 0.1155 0.0373 -0.1009 -0.2627 -0.2841 -0.3050 0.3883 -0.0440 -0.2199 -0.2562 0.1028 0.0451 -0.1933 -0.2513 0.2441 -0.1178 -0.2365 0.2806 -0.2487 -0.1820 -0.1219 -0.1543 -0.1887 0.1116 0.0965 0.0865 0.0939 0.0936 0.0974 0.1016 0.0939 0.1223 0.0931 0.0913 0.0883 0.0951 0.0881 0.0974 0.1209 0.1134 0.1426 0.1398 0.1566 0.1461 0.1455 0.1533 0.1568 0.1586 0.1573
va: 2.1161 2.0359 2.0693 3.7126 3.7497 3.8599 3.9079 3.9032 3.8588 4.1129 3.7718 3.9236 3.9397 3.8033 3.6003 3.9647 3.9469 3.7398 3.8886 4.0178 3.7046 3.9983 3.8849 3.8907 3.9025 3.9037 1.0050 1.0295 1.0050 1.0021 1.0022 1.0131 1.0001 1.0015 1.0227 0.9967 0.9962 1.0092 0.9971 1.0124 0.9963 0.9912 1.0112 1.0070 1.0135 0.9893 1.0053 1.0085 0.9993 0.9893 0.9906 0.9906
dispcorr: -0.023629915 hartree
energy: -1117.890966763000
dipole: -28.56042 27.73777 -0.82265 -0.00603 0.89544 0.88941 12.07564 -12.77798 -0.70234
magnitude: 1.40039 au
magnitude: 3.55951 debye
