program: Orca
programVersion: 5.0.2
elementType: O O O C C C C C C C C C C C C C C C C C C C C C C C H H H H H H H H H H H H H H H H H H H H H H H H H H
charge: 0
multiplicity: 1
keywords: wb97x-d3
keywords: def2-TZVPP
keywords: def2/J RIJCOSX
keywords: DEFGRID2
keywords: scfconv7
keywords: smallprint printgap noloewdin
keywords: NOSOSCF
formula: C23H26O3
InChI: InChI=1/C23H26O3/c1-16(2)13-20-21(23(20,3)4)22(24)25-15-17-9-8-12-19(14-17)26-18-10-6-5-7-11-18/h5-14,20-21H,15H2,1-4H3
52 atoms
O  -0.636756 0.951886 1.948739
O  -2.25828 1.67491 0.598263
O  3.771486 0.8456 -1.014128
C  -3.742557 -0.934249 1.450461
C  -2.92604 -1.374403 0.275101
C  -2.265914 -0.590416 1.41088
C  -4.123666 -1.990123 2.460891
C  -4.804199 0.122987 1.27885
C  -3.108556 -0.821531 -1.082691
C  -1.761133 0.785675 1.248672
C  -3.3660 -1.537676 -2.182871
C  -3.522484 -0.861557 -3.512328
C  -3.518275 -3.02792 -2.22555
C  0.02974 2.217942 1.859562
C  0.816613 2.332934 0.584938
C  1.922708 1.507766 0.396553
C  0.455627 3.241943 -0.401033
C  2.651848 1.590088 -0.781229
C  1.202755 3.327264 -1.568277
C  2.294943 2.500261 -1.769646
C  3.916548 -0.386879 -0.434247
C  5.112187 -0.654694 0.215111
C  2.932061 -1.361852 -0.542699
C  5.326316 -1.914847 0.757069
C  3.154666 -2.612706 0.01327
C  4.349018 -2.895287 0.664097
H  -2.637028 -2.419475 0.300388
H  -1.642405 -1.195478 2.058657
H  -3.348573 -2.749814 2.573068
H  -5.042239 -2.497113 2.157916
H  -4.299522 -1.546943 3.4435
H  -4.952022 0.678811 2.206929
H  -5.75267 -0.359452 1.033478
H  -4.593175 0.84062 0.491622
H  -3.035112 0.252919 -1.1978
H  -3.372094 0.216078 -3.447717
H  -4.517685 -1.038393 -3.929317
H  -2.809588 -1.256792 -4.241495
H  -2.714345 -3.483054 -2.811041
H  -4.451295 -3.300392 -2.725363
H  -3.524448 -3.502048 -1.245887
H  0.692571 2.237323 2.724189
H  -0.679301 3.04037 1.96366
H  2.21381 0.816114 1.178632
H  -0.403921 3.88392 -0.257899
H  0.924631 4.036677 -2.33688
H  2.874759 2.560763 -2.682219
H  5.870707 0.114655 0.289479
H  2.002574 -1.152838 -1.058039
H  6.261342 -2.124546 1.260493
H  2.388884 -3.373134 -0.070563
H  4.517321 -3.874939 1.091726
elementType: O C H
totalener: -1117.86709578 hartree
nucrepener: 2250.03460132 hartree
electener: -3367.90169711 hartree
oneelecener: -5989.98593593 hartree
twoeener: 2622.08423882 hartree
cpcmener: -0.02435652 hartree
kineticenergy: 1112.80149111 hartree
xcener: -110.226227464589 hartree
chargesum: -0.0000000
charge: -0.291496 -0.473480 -0.329368 0.130336 0.024966 -0.124850 -0.264086 -0.286102 -0.309130 0.411962 -0.027115 -0.224565 -0.258964 0.093207 -0.009606 -0.216685 -0.194872 0.274007 -0.124558 -0.245294 0.264416 -0.232450 -0.184683 -0.129322 -0.144517 -0.177525 0.110409 0.094555 0.086803 0.094172 0.093815 0.102066 0.094741 0.097542 0.125830 0.088640 0.093241 0.091764 0.098879 0.093235 0.088437 0.124353 0.111568 0.138739 0.139925 0.156192 0.146231 0.146239 0.157156 0.157634 0.159177 0.158432
qa: -0.2915 -0.4735 -0.3294 0.1303 0.0250 -0.1249 -0.2641 -0.2861 -0.3091 0.4120 -0.0271 -0.2246 -0.2590 0.0932 -0.0096 -0.2167 -0.1949 0.2740 -0.1246 -0.2453 0.2644 -0.2324 -0.1847 -0.1293 -0.1445 -0.1775 0.1104 0.0946 0.0868 0.0942 0.0938 0.1021 0.0947 0.0975 0.1258 0.0886 0.0932 0.0918 0.0989 0.0932 0.0884 0.1244 0.1116 0.1387 0.1399 0.1562 0.1462 0.1462 0.1572 0.1576 0.1592 0.1584
va: 2.1225 2.0224 2.0745 3.6988 3.7463 3.9214 3.9094 3.9051 3.8661 4.0941 3.7459 3.9267 3.9432 3.8163 3.6500 3.9323 3.9296 3.7284 3.9192 4.0001 3.7094 4.0085 3.9238 3.8858 3.8885 3.8995 1.0062 1.0295 1.0051 1.0018 1.0022 0.9997 1.0021 1.0145 1.0237 1.0087 0.9966 0.9955 0.9959 0.9979 1.0101 0.9938 1.0104 1.0133 1.0122 0.9898 1.0066 1.0071 0.9970 0.9895 0.9902 0.9904
dispcorr: -0.023639186 hartree
energy: -1117.890734970754
dipole: -27.88597 27.84977 -0.03620 -14.21600 13.07440 -1.14160 -2.91229 3.58518 0.67289
magnitude: 1.32564 au
magnitude: 3.36952 debye
