program: Orca
programVersion: 5.0.2
elementType: O O O C C C C C C C C C C C C C C C C C C C C C C C H H H H H H H H H H H H H H H H H H H H H H H H H H
charge: 0
multiplicity: 1
keywords: wb97x-d3
keywords: def2-TZVPP
keywords: def2/J RIJCOSX
keywords: DEFGRID2
keywords: scfconv7
keywords: smallprint printgap noloewdin
keywords: NOSOSCF
formula: C23H26O3
InChI: InChI=1/C23H26O3/c1-16(2)13-20-21(23(20,3)4)22(24)25-15-17-9-8-12-19(14-17)26-18-10-6-5-7-11-18/h5-14,20-21H,15H2,1-4H3
52 atoms
O  -1.095413 1.897341 0.76725
O  -1.238534 -0.328703 0.799335
O  3.350591 -0.835125 -2.102708
C  -4.166835 0.21684 -0.17242
C  -4.280981 0.089925 1.314162
C  -3.228392 1.022115 0.710055
C  -5.229472 1.031152 -0.872285
C  -3.656299 -0.923455 -1.017879
C  -3.937888 -1.134439 2.06147
C  -1.782158 0.749287 0.765119
C  -4.5636 -1.582484 3.156631
C  -4.107445 -2.842781 3.830689
C  -5.724024 -0.912898 3.829026
C  0.327587 1.811245 0.713596
C  0.819999 1.374465 -0.638528
C  1.863752 0.463896 -0.726911
C  0.257444 1.893827 -1.802233
C  2.352567 0.091073 -1.973655
C  0.737919 1.494543 -3.039139
C  1.793226 0.598397 -3.135294
C  4.464816 -0.742216 -1.314196
C  5.078425 0.475488 -1.044358
C  5.003017 -1.927823 -0.833996
C  6.237051 0.494997 -0.281264
C  6.168122 -1.893298 -0.081197
C  6.786889 -0.684011 0.204055
H  -5.099668 0.658968 1.74015
H  -3.467491 2.076681 0.783176
H  -6.090667 0.406958 -1.119855
H  -4.847782 1.454412 -1.80392
H  -5.586077 1.856516 -0.254283
H  -4.496865 -1.545865 -1.331208
H  -2.943562 -1.571054 -0.515862
H  -3.176373 -0.543276 -1.922017
H  -3.109372 -1.724917 1.691154
H  -4.896907 -3.599397 3.830039
H  -3.86042 -2.658473 4.879993
H  -3.228423 -3.274039 3.351483
H  -6.181819 -0.120064 3.241952
H  -5.419694 -0.48053 4.785693
H  -6.504635 -1.641844 4.057721
H  0.711076 1.157926 1.500077
H  0.670666 2.823267 0.931929
H  2.287041 0.040299 0.176905
H  -0.555988 2.606512 -1.749411
H  0.29708 1.894658 -3.942973
H  2.176122 0.293361 -4.100967
H  4.667429 1.401199 -1.427847
H  4.514848 -2.869292 -1.053318
H  6.715125 1.443355 -0.07173
H  6.587197 -2.81944 0.290687
H  7.691513 -0.659975 0.79728
elementType: O C H
totalener: -1117.86736014 hartree
nucrepener: 2190.10437855 hartree
electener: -3307.97173869 hartree
oneelecener: -5870.30376508 hartree
twoeener: 2562.33202639 hartree
cpcmener: -0.02596992 hartree
kineticenergy: 1112.80310753 hartree
xcener: -110.227727290317 hartree
chargesum: -0.0000000
charge: -0.294217 -0.464541 -0.332329 0.098804 0.029997 -0.078549 -0.261410 -0.281812 -0.291416 0.381889 -0.052344 -0.217952 -0.261142 0.103836 0.034873 -0.175183 -0.251565 0.233217 -0.115405 -0.238477 0.253504 -0.165838 -0.237215 -0.154561 -0.125814 -0.181619 0.115758 0.094204 0.094721 0.092890 0.086655 0.097836 0.097211 0.098445 0.120587 0.092930 0.091246 0.087757 0.089995 0.100801 0.092534 0.112353 0.120923 0.141185 0.140579 0.155981 0.146387 0.154202 0.146718 0.159097 0.156757 0.157513
qa: -0.2942 -0.4645 -0.3323 0.0988 0.0300 -0.0785 -0.2614 -0.2818 -0.2914 0.3819 -0.0523 -0.2180 -0.2611 0.1038 0.0349 -0.1752 -0.2516 0.2332 -0.1154 -0.2385 0.2535 -0.1658 -0.2372 -0.1546 -0.1258 -0.1816 0.1158 0.0942 0.0947 0.0929 0.0867 0.0978 0.0972 0.0984 0.1206 0.0929 0.0912 0.0878 0.0900 0.1008 0.0925 0.1124 0.1209 0.1412 0.1406 0.1560 0.1464 0.1542 0.1467 0.1591 0.1568 0.1575
va: 2.1151 2.0310 2.0644 3.7196 3.7489 3.8289 3.9087 3.9061 3.8632 4.1253 3.7806 3.9234 3.9394 3.8044 3.6175 3.9407 3.9538 3.7460 3.8938 4.0179 3.7218 3.8881 3.9978 3.9001 3.8917 3.8994 1.0029 1.0305 1.0017 1.0027 1.0054 1.0009 1.0144 1.0003 1.0247 0.9965 0.9956 1.0093 1.0125 0.9954 0.9979 1.0123 0.9911 1.0080 1.0131 0.9894 1.0056 0.9982 1.0076 0.9905 0.9893 0.9905
dispcorr: -0.023301249 hartree
energy: -1117.890661391113
dipole: -30.90413 30.34464 -0.55949 -4.78860 5.98961 1.20101 11.96056 -11.60575 0.35481
magnitude: 1.37162 au
magnitude: 3.48638 debye
