program: Orca
programVersion: 5.0.2
elementType: O O O C C C C C C C C C C C C C C C C C C C C C C C H H H H H H H H H H H H H H H H H H H H H H H H H H
charge: 0
multiplicity: 1
keywords: wb97x-d3
keywords: def2-TZVPP
keywords: def2/J RIJCOSX
keywords: DEFGRID2
keywords: scfconv7
keywords: smallprint printgap noloewdin
keywords: NOSOSCF
formula: C23H26O3
InChI: InChI=1/C23H26O3/c1-16(2)13-20-21(23(20,3)4)22(24)25-15-17-9-8-12-19(14-17)26-18-10-6-5-7-11-18/h5-14,20-21H,15H2,1-4H3
52 atoms
O  -1.094664 1.8833 0.773528
O  -1.263393 -0.341284 0.801433
O  3.364261 -0.85153 -2.086697
C  -4.180914 0.234447 -0.184936
C  -4.300296 0.110868 1.301361
C  -3.236849 1.031647 0.698962
C  -5.236424 1.056594 -0.886526
C  -3.677932 -0.909749 -1.029969
C  -3.976628 -1.117909 2.049588
C  -1.794468 0.742882 0.767079
C  -4.589824 -1.541331 3.161695
C  -4.172085 -2.823747 3.818847
C  -5.708342 -0.831876 3.862674
C  0.327165 1.781658 0.726326
C  0.819733 1.343723 -0.625458
C  1.872145 0.442956 -0.712358
C  0.249711 1.852817 -1.790045
C  2.360072 0.068071 -1.958781
C  0.730505 1.452263 -3.026409
C  1.792858 0.564517 -3.121341
C  4.485159 -0.744494 -1.309991
C  5.088478 0.479895 -1.047272
C  5.042182 -1.924141 -0.83625
C  6.25627 0.511927 -0.29856
C  6.21636 -1.876972 -0.098534
C  6.825145 -0.660943 0.179579
H  -5.114495 0.689689 1.722525
H  -3.465391 2.088654 0.77066
H  -5.592125 1.88083 -0.266445
H  -6.099424 0.436832 -1.139141
H  -4.850229 1.481944 -1.815313
H  -3.187994 -0.533128 -1.930201
H  -4.52317 -1.522188 -1.350395
H  -2.975555 -1.566541 -0.525297
H  -3.180817 -1.739958 1.659488
H  -3.87545 -2.652632 4.857409
H  -3.335811 -3.299415 3.306301
H  -4.998677 -3.539045 3.850009
H  -6.556789 -1.505665 4.007664
H  -6.075715 0.048703 3.339631
H  -5.394727 -0.515316 4.861278
H  0.700092 1.121062 1.51182
H  0.680863 2.788867 0.950305
H  2.30328 0.02872 0.19212
H  -0.570432 2.557806 -1.738687
H  0.281511 1.842049 -3.93074
H  2.17414 0.256033 -4.086535
H  4.662367 1.401187 -1.424809
H  4.562429 -2.870951 -1.051158
H  6.725902 1.46554 -0.093802
H  6.649836 -2.79844 0.268454
H  7.73653 -0.626979 0.761861
elementType: O C H
totalener: -1117.86746965 hartree
nucrepener: 2188.99827950 hartree
electener: -3306.86574915 hartree
oneelecener: -5868.08335226 hartree
twoeener: 2561.21760311 hartree
cpcmener: -0.02612856 hartree
kineticenergy: 1112.79990596 hartree
xcener: -110.227226670331 hartree
chargesum: -0.0000000
charge: -0.294449 -0.464084 -0.332071 0.100443 0.023373 -0.075383 -0.261616 -0.281743 -0.284067 0.379608 -0.059014 -0.218051 -0.256650 0.104367 0.036174 -0.177546 -0.251260 0.234496 -0.115356 -0.238881 0.254722 -0.166682 -0.238002 -0.154739 -0.125641 -0.181923 0.118027 0.094021 0.086395 0.094702 0.093142 0.098575 0.097804 0.097359 0.119821 0.091359 0.088036 0.092845 0.093712 0.088802 0.097794 0.112403 0.120663 0.141185 0.140604 0.156056 0.146306 0.154124 0.146709 0.159063 0.156863 0.157605
qa: -0.2944 -0.4641 -0.3321 0.1004 0.0234 -0.0754 -0.2616 -0.2817 -0.2841 0.3796 -0.0590 -0.2181 -0.2567 0.1044 0.0362 -0.1775 -0.2513 0.2345 -0.1154 -0.2389 0.2547 -0.1667 -0.2380 -0.1547 -0.1256 -0.1819 0.1180 0.0940 0.0864 0.0947 0.0931 0.0986 0.0978 0.0974 0.1198 0.0914 0.0880 0.0928 0.0937 0.0888 0.0978 0.1124 0.1207 0.1412 0.1406 0.1561 0.1463 0.1541 0.1467 0.1591 0.1569 0.1576
va: 2.1145 2.0309 2.0644 3.7197 3.7544 3.8184 3.9084 3.9049 3.8563 4.1276 3.7905 3.9222 3.9379 3.8041 3.6166 3.9460 3.9529 3.7449 3.8939 4.0185 3.7205 3.8882 3.9976 3.9006 3.8919 3.8995 1.0011 1.0306 1.0055 1.0017 1.0027 1.0002 1.0009 1.0147 1.0242 0.9961 1.0092 0.9965 0.9973 1.0140 0.9964 1.0125 0.9912 1.0079 1.0134 0.9894 1.0057 0.9983 1.0077 0.9905 0.9893 0.9905
dispcorr: -0.023294295 hartree
energy: -1117.890763941893
dipole: -31.02392 30.46011 -0.56381 -4.53709 5.74108 1.20399 11.89337 -11.54571 0.34766
magnitude: 1.37418 au
magnitude: 3.49288 debye
