program: Orca
programVersion: 5.0.2
elementType: O O O C C C C C C C C C C C C C C C C C C C C C C C H H H H H H H H H H H H H H H H H H H H H H H H H H
charge: 0
multiplicity: 1
keywords: wb97x-d3
keywords: def2-TZVPP
keywords: def2/J RIJCOSX
keywords: DEFGRID2
keywords: scfconv7
keywords: smallprint printgap noloewdin
keywords: NOSOSCF
formula: C23H26O3
InChI: InChI=1/C23H26O3/c1-16(2)13-20-21(23(20,3)4)22(24)25-15-17-9-8-12-19(14-17)26-18-10-6-5-7-11-18/h5-14,20-21H,15H2,1-4H3
52 atoms
O  -1.820472 1.360905 -1.199539
O  -1.766883 1.241927 1.02982
O  2.552315 -1.017185 -0.924325
C  -2.825351 -1.670389 0.451327
C  -3.989462 -0.837687 0.862013
C  -3.060252 -0.333536 -0.238404
C  -3.101193 -2.880052 -0.409557
C  -1.647924 -1.864917 1.373282
C  -4.085496 -0.191876 2.194585
C  -2.165632 0.813894 -0.025662
C  -4.863763 0.854611 2.47913
C  -4.932995 1.425187 3.86257
C  -5.687623 1.567781 1.452529
C  -0.86868 2.419001 -1.171795
C  0.504068 1.962278 -0.758387
C  0.948451 0.678536 -1.049343
C  1.356137 2.851688 -0.113345
C  2.22393 0.283035 -0.670254
C  2.634777 2.451116 0.243062
C  3.079895 1.164549 -0.021507
C  3.857289 -1.368638 -1.14587
C  4.363544 -2.443721 -0.431433
C  4.632759 -0.718472 -2.098271
C  5.660192 -2.875227 -0.676173
C  5.929525 -1.154381 -2.326231
C  6.448685 -2.231266 -1.618855
H  -4.943983 -1.161072 0.454503
H  -3.446722 -0.405348 -1.248587
H  -2.23907 -3.120806 -1.035163
H  -3.957673 -2.72678 -1.067456
H  -3.312871 -3.752867 0.211881
H  -1.439363 -1.013667 2.016362
H  -0.743261 -2.072305 0.797442
H  -1.827476 -2.726621 2.019712
H  -3.497013 -0.627568 2.996547
H  -5.951713 1.383271 4.257238
H  -4.645083 2.480155 3.865133
H  -4.279919 0.898575 4.558762
H  -6.707473 1.727041 1.808817
H  -5.745327 1.040866 0.502354
H  -5.272952 2.559395 1.254499
H  -1.210775 3.23496 -0.530587
H  -0.848037 2.796716 -2.195283
H  0.31086 -0.034326 -1.559265
H  1.016611 3.852928 0.12232
H  3.292044 3.142686 0.754289
H  4.071366 0.860026 0.287909
H  3.744975 -2.940521 0.30549
H  4.231283 0.115154 -2.661358
H  6.053903 -3.716833 -0.121043
H  6.535893 -0.649895 -3.067459
H  7.460211 -2.567643 -1.804724
elementType: O C H
totalener: -1117.86620474 hartree
nucrepener: 2236.59134585 hartree
electener: -3354.45755060 hartree
oneelecener: -5963.56070264 hartree
twoeener: 2609.10315204 hartree
cpcmener: -0.02716249 hartree
kineticenergy: 1112.81409416 hartree
xcener: -110.229749006914 hartree
chargesum: -0.0000000
charge: -0.299928 -0.452586 -0.332613 0.139888 -0.034928 -0.081891 -0.263113 -0.302138 -0.248732 0.363382 -0.028787 -0.227880 -0.268092 0.101156 0.061617 -0.305415 -0.231958 0.299059 -0.130879 -0.206629 0.246330 -0.224193 -0.172990 -0.136353 -0.153922 -0.169602 0.112508 0.092483 0.095482 0.086360 0.094136 0.095648 0.095682 0.104234 0.121693 0.094441 0.092931 0.088520 0.101121 0.091505 0.100416 0.113468 0.119995 0.127901 0.139791 0.157881 0.153869 0.147791 0.157842 0.157764 0.159108 0.158628
qa: -0.2999 -0.4526 -0.3326 0.1399 -0.0349 -0.0819 -0.2631 -0.3021 -0.2487 0.3634 -0.0288 -0.2279 -0.2681 0.1012 0.0616 -0.3054 -0.2320 0.2991 -0.1309 -0.2066 0.2463 -0.2242 -0.1730 -0.1364 -0.1539 -0.1696 0.1125 0.0925 0.0955 0.0864 0.0941 0.0956 0.0957 0.1042 0.1217 0.0944 0.0929 0.0885 0.1011 0.0915 0.1004 0.1135 0.1200 0.1279 0.1398 0.1579 0.1539 0.1478 0.1578 0.1578 0.1591 0.1586
va: 2.1060 2.0305 2.0552 3.7480 3.8494 3.8245 3.8972 3.9009 3.8449 4.1191 3.7231 3.9296 3.9462 3.8036 3.6141 4.0407 3.9858 3.7113 3.9069 3.9217 3.7243 3.9986 3.9159 3.8932 3.8969 3.8914 1.0027 1.0312 1.0027 1.0047 1.0021 1.0151 1.0050 0.9994 0.9991 0.9967 0.9958 1.0074 1.0001 1.0056 0.9967 1.0100 0.9917 1.0325 1.0036 0.9907 0.9982 1.0059 0.9961 0.9897 0.9905 0.9900
dispcorr: -0.024708815 hartree
energy: -1117.890913558820
dipole: -22.82138 22.93149 0.11011 -2.96004 2.98906 0.02902 10.54684 -11.33973 -0.79288
magnitude: 0.80102 au
magnitude: 2.03603 debye
