program: Orca
programVersion: 5.0.2
elementType: O O O C C C C C C C C C C C C C C C C C C C C C C C H H H H H H H H H H H H H H H H H H H H H H H H H H
charge: 0
multiplicity: 1
keywords: wb97x-d3
keywords: def2-TZVPP
keywords: def2/J RIJCOSX
keywords: DEFGRID2
keywords: scfconv7
keywords: smallprint printgap noloewdin
keywords: NOSOSCF
formula: C23H26O3
InChI: InChI=1/C23H26O3/c1-16(2)13-20-21(23(20,3)4)22(24)25-15-17-9-8-12-19(14-17)26-18-10-6-5-7-11-18/h5-14,20-21H,15H2,1-4H3
52 atoms
O  -1.758111 1.158972 -0.446526
O  -3.780368 1.765544 0.259029
O  3.352411 0.933242 0.066262
C  -2.793713 -1.599861 -1.073191
C  -2.608573 -1.642322 0.40604
C  -3.421203 -0.508585 -0.230029
C  -3.794963 -2.566539 -1.665416
C  -1.627324 -1.348158 -1.997737
C  -1.294342 -1.41436 1.05825
C  -3.016206 0.904271 -0.117933
C  -1.127776 -0.977873 2.309698
C  0.237898 -0.844394 2.910124
C  -2.260976 -0.587692 3.207205
C  -1.285797 2.501948 -0.291319
C  0.149677 2.530486 -0.723601
C  1.076562 1.684153 -0.122132
C  0.56837 3.419071 -1.707019
C  2.402752 1.720461 -0.525824
C  1.903136 3.462256 -2.085575
C  2.826263 2.606498 -1.506694
C  3.135232 -0.407419 0.216266
C  2.384355 -1.153516 -0.684745
C  3.750289 -1.02099 1.300179
C  2.243991 -2.519487 -0.481746
C  3.609004 -2.388335 1.483135
C  2.849662 -3.143887 0.599801
H  -3.249159 -2.347044 0.930209
H  -4.492371 -0.602051 -0.09192
H  -4.19692 -2.18617 -2.606862
H  -4.636339 -2.745968 -0.994802
H  -3.324362 -3.530277 -1.870824
H  -0.81364 -0.780982 -1.554943
H  -1.951269 -0.817425 -2.895016
H  -1.214684 -2.306861 -2.319478
H  -0.408147 -1.666589 0.482763
H  0.328879 -1.447926 3.817633
H  0.439193 0.188185 3.208371
H  1.023367 -1.157028 2.222189
H  -2.113237 0.422684 3.596886
H  -2.309994 -1.246442 4.078542
H  -3.231828 -0.615165 2.715513
H  -1.382629 2.807182 0.75383
H  -1.880741 3.187849 -0.897712
H  0.765032 1.001635 0.660797
H  -0.148747 4.079024 -2.179311
H  2.225335 4.156933 -2.850239
H  3.866166 2.625301 -1.8075
H  1.915243 -0.687017 -1.54178
H  4.334098 -0.428951 1.994112
H  1.658277 -3.098018 -1.184702
H  4.088033 -2.86158 2.330629
H  2.734248 -4.209167 0.749914
elementType: O C H
totalener: -1117.86459076 hartree
nucrepener: 2386.43290037 hartree
electener: -3504.29749114 hartree
oneelecener: -6261.87031808 hartree
twoeener: 2757.57282694 hartree
cpcmener: -0.02505586 hartree
kineticenergy: 1112.80690273 hartree
xcener: -110.230635286640 hartree
chargesum: -0.0000000
charge: -0.261656 -0.478417 -0.330036 0.159361 -0.031952 -0.136788 -0.270341 -0.267326 -0.226852 0.406546 -0.054368 -0.160973 -0.260972 0.062481 -0.029393 -0.171205 -0.173955 0.240336 -0.130406 -0.220874 0.284136 -0.189438 -0.240800 -0.141382 -0.117824 -0.185430 0.109182 0.093570 0.096048 0.086645 0.093010 0.052360 0.106595 0.097995 0.105174 0.113828 0.099301 0.005084 0.097690 0.107725 0.090166 0.121958 0.106578 0.129281 0.142676 0.157138 0.145745 0.158637 0.141997 0.157164 0.155343 0.156635
qa: -0.2617 -0.4784 -0.3300 0.1594 -0.0320 -0.1368 -0.2703 -0.2673 -0.2269 0.4065 -0.0544 -0.1610 -0.2610 0.0625 -0.0294 -0.1712 -0.1740 0.2403 -0.1304 -0.2209 0.2841 -0.1894 -0.2408 -0.1414 -0.1178 -0.1854 0.1092 0.0936 0.0960 0.0866 0.0930 0.0524 0.1066 0.0980 0.1052 0.1138 0.0993 0.0051 0.0977 0.1077 0.0902 0.1220 0.1066 0.1293 0.1427 0.1571 0.1457 0.1586 0.1420 0.1572 0.1553 0.1566
va: 2.1176 2.0253 2.0855 3.7187 3.8120 3.8642 3.9044 3.9149 3.7843 4.1271 3.7439 3.8931 3.9370 3.8110 3.7672 3.8842 3.9107 3.7390 3.9063 3.9915 3.6836 3.8321 3.9488 3.8468 3.8697 3.8916 1.0067 1.0295 1.0016 1.0052 1.0022 1.0046 1.0045 0.9997 0.9970 0.9999 0.9988 1.0420 0.9987 0.9978 1.0082 0.9948 1.0092 1.0101 1.0017 0.9897 1.0059 0.9937 1.0100 0.9943 0.9895 0.9909
dispcorr: -0.031133710 hartree
energy: -1117.895724474141
dipole: -11.25918 11.82727 0.56808 -13.86883 12.97228 -0.89656 4.02011 -4.34119 -0.32108
magnitude: 1.10888 au
magnitude: 2.81856 debye
