program: Orca
programVersion: 5.0.2
elementType: O O O C C C C C C C C C C C C C C C C C C C C C C C H H H H H H H H H H H H H H H H H H H H H H H H H H
charge: 0
multiplicity: 1
keywords: wb97x-d3
keywords: def2-TZVPP
keywords: def2/J RIJCOSX
keywords: DEFGRID2
keywords: scfconv7
keywords: smallprint printgap noloewdin
keywords: NOSOSCF
formula: C23H26O3
InChI: InChI=1/C23H26O3/c1-16(2)13-20-21(23(20,3)4)22(24)25-15-17-9-8-12-19(14-17)26-18-10-6-5-7-11-18/h5-14,20-21H,15H2,1-4H3
52 atoms
O  -1.526427 2.073841 0.847628
O  -2.188868 1.19455 -1.090383
O  3.39324 1.037244 -0.260291
C  -3.62118 -0.968413 0.620456
C  -2.212733 -1.477615 0.603479
C  -2.495305 -0.017624 0.967988
C  -4.482797 -1.381303 1.790786
C  -4.400049 -0.8472 -0.66592
C  -1.507626 -1.863113 -0.635966
C  -2.076777 1.105125 0.108975
C  -0.964935 -3.062008 -0.879336
C  -0.246003 -3.326104 -2.168219
C  -1.011814 -4.232706 0.054797
C  -1.000908 3.207673 0.156922
C  0.238896 2.876433 -0.626406
C  1.231138 2.088198 -0.052395
C  0.411694 3.378605 -1.910114
C  2.375735 1.78739 -0.777819
C  1.576014 3.099692 -2.611736
C  2.558362 2.294467 -2.058036
C  3.125034 -0.002867 0.588138
C  2.087504 -0.899085 0.356534
C  3.973073 -0.16829 1.674323
C  1.897215 -1.954691 1.235665
C  3.780821 -1.240281 2.535094
C  2.738506 -2.132403 2.32597
H  -1.937754 -2.058128 1.477641
H  -2.388473 0.197553 2.024857
H  -4.949273 -2.350289 1.601237
H  -5.281686 -0.65704 1.963861
H  -3.906657 -1.466914 2.713282
H  -5.125466 -0.033351 -0.60853
H  -4.959595 -1.770516 -0.830084
H  -3.784655 -0.683458 -1.545498
H  -1.425819 -1.116172 -1.41704
H  -0.680631 -4.179052 -2.696725
H  0.802035 -3.579457 -1.984374
H  -0.269121 -2.467099 -2.838878
H  -0.014399 -4.65407 0.203671
H  -1.619087 -5.034897 -0.374436
H  -1.427169 -4.002726 1.034257
H  -0.773993 3.924966 0.946363
H  -1.759532 3.656504 -0.487725
H  1.108843 1.710366 0.955721
H  -0.363406 3.984255 -2.363157
H  1.711823 3.493671 -3.610652
H  3.458891 2.058592 -2.611125
H  1.430025 -0.782908 -0.496724
H  4.779281 0.535325 1.840878
H  1.084329 -2.646338 1.058072
H  4.445489 -1.368434 3.379765
H  2.582959 -2.961067 3.004143
elementType: O C H
totalener: -1117.86688142 hartree
nucrepener: 2348.88013672 hartree
electener: -3466.74701814 hartree
oneelecener: -6187.60155704 hartree
twoeener: 2720.85453890 hartree
cpcmener: -0.02443958 hartree
kineticenergy: 1112.79793266 hartree
xcener: -110.229286737809 hartree
chargesum: -0.0000000
charge: -0.295078 -0.463844 -0.331130 0.139072 0.013185 -0.104880 -0.265117 -0.287291 -0.325623 0.389779 -0.031773 -0.231914 -0.268411 0.100513 0.042018 -0.247081 -0.230795 0.286173 -0.108350 -0.260788 0.305766 -0.242919 -0.265506 -0.061400 -0.091498 -0.256499 0.111433 0.096863 0.093959 0.094765 0.086848 0.102794 0.094037 0.098310 0.127557 0.100956 0.092088 0.091632 0.091393 0.113923 0.095540 0.121388 0.113520 0.138404 0.141166 0.156904 0.145556 0.157530 0.144643 0.172317 0.156901 0.152966
qa: -0.2951 -0.4638 -0.3311 0.1391 0.0132 -0.1049 -0.2651 -0.2873 -0.3256 0.3898 -0.0318 -0.2319 -0.2684 0.1005 0.0420 -0.2471 -0.2308 0.2862 -0.1084 -0.2608 0.3058 -0.2429 -0.2655 -0.0614 -0.0915 -0.2565 0.1114 0.0969 0.0940 0.0948 0.0868 0.1028 0.0940 0.0983 0.1276 0.1010 0.0921 0.0916 0.0914 0.1139 0.0955 0.1214 0.1135 0.1384 0.1412 0.1569 0.1456 0.1575 0.1446 0.1723 0.1569 0.1530
va: 2.1143 2.0291 2.0837 3.7418 3.7373 3.9121 3.9054 3.9051 3.8098 4.0974 3.7267 3.9174 3.9242 3.8081 3.6180 3.9229 3.9730 3.7161 3.8916 4.0146 3.7341 3.9418 4.0239 3.7647 3.8579 4.0013 1.0046 1.0287 1.0022 1.0022 1.0050 1.0004 1.0016 1.0139 1.0217 0.9979 0.9957 1.0078 0.9953 0.9968 1.0099 0.9922 1.0095 1.0185 1.0038 0.9890 1.0069 0.9975 1.0084 0.9665 0.9885 0.9966
dispcorr: -0.027862035 hartree
energy: -1117.894743457912
dipole: -18.01682 17.57694 -0.43988 -20.92174 20.41672 -0.50502 0.31750 0.73746 1.05496
magnitude: 1.24959 au
magnitude: 3.17622 debye
