program: Orca
programVersion: 5.0.2
elementType: O O O C C C C C C C C C C C C C C C C C C C C C C C H H H H H H H H H H H H H H H H H H H H H H H H H H
charge: 0
multiplicity: 1
keywords: wb97x-d3
keywords: def2-TZVPP
keywords: def2/J RIJCOSX
keywords: DEFGRID2
keywords: scfconv7
keywords: smallprint printgap noloewdin
keywords: NOSOSCF
formula: C23H26O3
InChI: InChI=1/C23H26O3/c1-16(2)13-20-21(23(20,3)4)22(24)25-15-17-9-8-12-19(14-17)26-18-10-6-5-7-11-18/h5-14,20-21H,15H2,1-4H3
52 atoms
O  -1.301367 1.421453 -1.142267
O  -1.336499 1.288002 1.087796
O  3.72691 0.738031 -0.614729
C  -1.513638 -1.793931 0.499411
C  -2.936814 -1.364468 0.676096
C  -2.020311 -0.583015 -0.265811
C  -1.262467 -3.018089 -0.347698
C  -0.5179 -1.645938 1.622475
C  -3.466271 -0.810414 1.93673
C  -1.532528 0.779318 0.010647
C  -4.637383 -1.130288 2.500207
C  -5.054266 -0.495778 3.793987
C  -5.634115 -2.103349 1.946136
C  -0.785948 2.743569 -1.100307
C  0.719644 2.795832 -1.071307
C  1.504455 1.667716 -0.866918
C  1.326748 4.034365 -1.260119
C  2.89055 1.787269 -0.855737
C  2.707958 4.139055 -1.244543
C  3.500157 3.019059 -1.047642
C  3.311747 -0.557306 -0.778005
C  2.830821 -1.016731 -1.998131
C  3.45944 -1.419239 0.29822
C  2.495972 -2.356233 -2.131222
C  3.131688 -2.760097 0.148063
C  2.646563 -3.232104 -1.063041
H  -3.64744 -1.961501 0.11557
H  -2.2057 -0.761761 -1.318419
H  -1.98942 -3.114651 -1.155524
H  -1.319515 -3.923836 0.259883
H  -0.267936 -2.982923 -0.797562
H  -0.52177 -2.552707 2.230835
H  -0.71415 -0.809963 2.28751
H  0.492806 -1.525618 1.22646
H  -2.849969 -0.088916 2.458234
H  -5.177256 -1.247368 4.578795
H  -6.021621 0.004109 3.692815
H  -4.331644 0.240678 4.145991
H  -5.277884 -2.664611 1.084696
H  -6.551303 -1.58725 1.648926
H  -5.925636 -2.827446 2.711056
H  -1.200693 3.299849 -0.256599
H  -1.148932 3.222056 -2.010704
H  1.052754 0.695782 -0.719992
H  0.718499 4.915963 -1.424389
H  3.17746 5.102261 -1.397365
H  4.580029 3.096737 -1.039241
H  2.724623 -0.340923 -2.837894
H  3.836963 -1.044797 1.241521
H  2.121376 -2.717691 -3.080227
H  3.251403 -3.434144 0.986423
H  2.387507 -4.276696 -1.175947
elementType: O C H
totalener: -1117.86683656 hartree
nucrepener: 2299.62273680 hartree
electener: -3417.48957336 hartree
oneelecener: -6088.98518489 hartree
twoeener: 2671.49561153 hartree
cpcmener: -0.02500745 hartree
kineticenergy: 1112.78720992 hartree
xcener: -110.229317066364 hartree
chargesum: 0.0000000
charge: -0.293150 -0.459944 -0.324461 0.128776 0.032675 -0.086694 -0.265189 -0.272623 -0.306737 0.368746 -0.045882 -0.219639 -0.259472 0.087171 0.022129 -0.219281 -0.259873 0.322410 -0.101340 -0.270137 0.275949 -0.200671 -0.217340 -0.124445 -0.132566 -0.193954 0.115199 0.094571 0.091390 0.097083 0.080067 0.102492 0.101900 0.069903 0.120897 0.092974 0.091168 0.088005 0.089569 0.099251 0.093035 0.115551 0.127836 0.128821 0.140348 0.155651 0.143307 0.156836 0.144096 0.159301 0.156780 0.159510
qa: -0.2932 -0.4599 -0.3245 0.1288 0.0327 -0.0867 -0.2652 -0.2726 -0.3067 0.3687 -0.0459 -0.2196 -0.2595 0.0872 0.0221 -0.2193 -0.2599 0.3224 -0.1013 -0.2701 0.2759 -0.2007 -0.2173 -0.1244 -0.1326 -0.1940 0.1152 0.0946 0.0914 0.0971 0.0801 0.1025 0.1019 0.0699 0.1209 0.0930 0.0912 0.0880 0.0896 0.0993 0.0930 0.1156 0.1278 0.1288 0.1403 0.1557 0.1433 0.1568 0.1441 0.1593 0.1568 0.1595
va: 2.1178 2.0283 2.0848 3.6675 3.7457 3.8552 3.9079 3.9001 3.8672 4.1305 3.7740 3.9245 3.9406 3.8419 3.6749 3.9254 3.9869 3.7111 3.8909 4.0021 3.6795 3.9307 3.9600 3.8266 3.8277 3.8509 1.0034 1.0302 1.0075 1.0022 1.0119 1.0024 1.0184 1.0152 1.0275 0.9965 0.9957 1.0092 1.0122 0.9960 0.9977 1.0127 0.9914 1.0114 1.0013 0.9890 1.0098 0.9958 1.0078 0.9894 0.9903 0.9905
dispcorr: -0.026640129 hartree
energy: -1117.893476691244
dipole: -23.70390 22.94577 -0.75813 -16.01558 15.17447 -0.84111 11.17946 -12.12198 -0.94252
magnitude: 1.47329 au
magnitude: 3.74480 debye
