program: Orca
programVersion: 5.0.2
elementType: O O O C C C C C C C C C C C C C C C C C C C C C C C H H H H H H H H H H H H H H H H H H H H H H H H H H
charge: 0
multiplicity: 1
keywords: wb97x-d3
keywords: def2-TZVPP
keywords: def2/J RIJCOSX
keywords: DEFGRID2
keywords: scfconv7
keywords: smallprint printgap noloewdin
keywords: NOSOSCF
formula: C23H26O3
InChI: InChI=1/C23H26O3/c1-16(2)13-20-21(23(20,3)4)22(24)25-15-17-9-8-12-19(14-17)26-18-10-6-5-7-11-18/h5-14,20-21H,15H2,1-4H3
52 atoms
O  -1.140248 -0.032184 1.987816
O  -2.713243 1.234488 1.031538
O  3.645821 0.917202 -0.301918
C  -4.166871 -1.406135 0.318568
C  -3.122557 -1.263276 -0.734193
C  -2.736653 -1.146897 0.746856
C  -4.659675 -2.805784 0.607006
C  -5.249481 -0.367928 0.484219
C  -3.067569 -0.097996 -1.652382
C  -2.24111 0.144662 1.249586
C  -1.956943 0.367746 -2.229237
C  -1.99338 1.525079 -3.17867
C  -0.595277 -0.200674 -1.975898
C  -0.43198 1.133768 2.430084
C  0.443527 1.673437 1.334192
C  1.629189 1.009903 1.029309
C  0.081224 2.805451 0.61221
C  2.439527 1.478209 0.00414
C  0.902783 3.268276 -0.406326
C  2.077511 2.605402 -0.722553
C  3.847622 -0.429689 -0.172066
C  2.928133 -1.362103 -0.637225
C  5.050622 -0.838485 0.385312
C  3.222274 -2.713506 -0.531483
C  5.336971 -2.193546 0.473091
C  4.423688 -3.136212 0.022094
H  -2.772982 -2.196761 -1.167871
H  -2.208496 -2.004215 1.148075
H  -5.042162 -2.885352 1.62672
H  -3.871117 -3.550509 0.488752
H  -5.471262 -3.07356 -0.072811
H  -4.95198 0.636922 0.200048
H  -5.590752 -0.331485 1.520639
H  -6.109362 -0.641957 -0.130856
H  -4.010856 0.385935 -1.888612
H  -1.564329 1.255412 -4.147481
H  -1.39494 2.357526 -2.797711
H  -3.006592 1.889631 -3.348528
H  0.102824 0.590072 -1.688747
H  -0.188759 -0.651923 -2.885577
H  -0.584135 -0.958947 -1.194543
H  0.170657 0.788475 3.269446
H  -1.120459 1.89376 2.801441
H  1.920019 0.140928 1.608719
H  -0.834251 3.331368 0.848792
H  0.622629 4.150743 -0.966953
H  2.718037 2.963511 -1.518887
H  1.995093 -1.044063 -1.085368
H  5.758803 -0.100063 0.740096
H  2.506037 -3.439765 -0.893621
H  6.277931 -2.510354 0.904162
H  4.647259 -4.192212 0.097315
elementType: O C H
totalener: -1117.86629523 hartree
nucrepener: 2332.23570233 hartree
electener: -3450.10199756 hartree
oneelecener: -6154.25946015 hartree
twoeener: 2704.15746259 hartree
cpcmener: -0.02452275 hartree
kineticenergy: 1112.80783580 hartree
xcener: -110.228899909655 hartree
chargesum: 0.0000000
charge: -0.287787 -0.462613 -0.328954 0.139967 -0.026160 -0.109130 -0.264309 -0.299887 -0.265891 0.382488 -0.016456 -0.222874 -0.248636 0.077813 -0.007963 -0.211721 -0.175205 0.268381 -0.155067 -0.212237 0.192591 -0.114886 -0.196333 -0.216430 -0.151932 -0.146753 0.111516 0.093623 0.094648 0.085693 0.093921 0.095038 0.099819 0.097122 0.120024 0.096205 0.091973 0.089830 0.057667 0.120445 0.093871 0.122597 0.113062 0.139615 0.138274 0.156038 0.143767 0.190633 0.145700 0.154261 0.157281 0.157358
qa: -0.2878 -0.4626 -0.3290 0.1400 -0.0262 -0.1091 -0.2643 -0.2999 -0.2659 0.3825 -0.0165 -0.2229 -0.2486 0.0778 -0.0080 -0.2117 -0.1752 0.2684 -0.1551 -0.2122 0.1926 -0.1149 -0.1963 -0.2164 -0.1519 -0.1468 0.1115 0.0936 0.0946 0.0857 0.0939 0.0950 0.0998 0.0971 0.1200 0.0962 0.0920 0.0898 0.0577 0.1204 0.0939 0.1226 0.1131 0.1396 0.1383 0.1560 0.1438 0.1906 0.1457 0.1543 0.1573 0.1574
va: 2.1114 2.0271 2.0798 3.7409 3.8196 3.8238 3.8996 3.8921 3.8616 4.1401 3.7253 3.9247 3.9184 3.8250 3.6219 3.9297 3.8686 3.7184 3.9046 3.9393 3.7847 3.8292 3.9668 3.9681 3.9070 3.8745 1.0054 1.0307 1.0028 1.0046 1.0023 1.0170 1.0008 0.9984 1.0005 0.9959 0.9967 1.0079 1.0106 1.0001 1.0014 0.9958 1.0111 1.0099 1.0169 0.9914 1.0071 0.9499 1.0074 0.9956 0.9898 0.9906
dispcorr: -0.028680607 hartree
energy: -1117.894975835639
dipole: -20.67805 20.94671 0.26866 -6.94586 5.85294 -1.09292 -8.26728 8.35168 0.08441
magnitude: 1.12862 au
magnitude: 2.86872 debye
