program: Orca
programVersion: 5.0.2
elementType: O O O C C C C C C C C C C C C C C C C C C C C C C C H H H H H H H H H H H H H H H H H H H H H H H H H H
charge: 0
multiplicity: 1
keywords: wb97x-d3
keywords: def2-TZVPP
keywords: def2/J RIJCOSX
keywords: DEFGRID2
keywords: scfconv7
keywords: smallprint printgap noloewdin
keywords: NOSOSCF
formula: C23H26O3
InChI: InChI=1/C23H26O3/c1-16(2)13-20-21(23(20,3)4)22(24)25-15-17-9-8-12-19(14-17)26-18-10-6-5-7-11-18/h5-14,20-21H,15H2,1-4H3
52 atoms
O  -1.763595 0.543365 -1.34795
O  -2.775191 2.498858 -0.995097
O  3.065886 1.081725 0.774666
C  -4.005499 -0.845325 0.09324
C  -3.094842 -0.402621 1.192709
C  -3.579001 0.611693 0.164116
C  -5.451611 -1.080877 0.465536
C  -3.534036 -1.774643 -0.999506
C  -1.660847 -0.772969 1.310563
C  -2.679914 1.312623 -0.772858
C  -1.196158 -1.993593 1.588098
C  0.274316 -2.235873 1.745174
C  -2.065256 -3.199081 1.768083
C  -0.824296 1.152445 -2.241461
C  0.281553 1.850386 -1.501568
C  1.157806 1.100457 -0.719689
C  0.436846 3.227556 -1.588912
C  2.193903 1.734212 -0.047863
C  1.47244 3.851613 -0.906591
C  2.355904 3.111847 -0.139664
C  3.460476 -0.206079 0.543376
C  3.705569 -0.70509 -0.730429
C  3.678361 -0.996129 1.664674
C  4.150629 -2.012469 -0.870648
C  4.135151 -2.296318 1.509393
C  4.36635 -2.813726 0.242047
H  -3.586964 -0.261626 2.153022
H  -4.343326 1.289951 0.525427
H  -6.105559 -0.952793 -0.399696
H  -5.792386 -0.39536 1.242858
H  -5.590359 -2.098554 0.837583
H  -3.862413 -2.789977 -0.769502
H  -2.455638 -1.804866 -1.121775
H  -3.978298 -1.506283 -1.960127
H  -0.941713 0.037764 1.237729
H  0.637238 -2.955984 1.006367
H  0.505817 -2.65742 2.727175
H  0.851388 -1.319111 1.630749
H  -1.811654 -3.975689 1.041689
H  -3.127845 -2.981983 1.673602
H  -1.903473 -3.640202 2.755544
H  -1.328403 1.832312 -2.929626
H  -0.428839 0.320606 -2.823565
H  1.025139 0.027105 -0.645242
H  -0.24727 3.812287 -2.190482
H  1.595653 4.924639 -0.973622
H  3.166743 3.594892 0.391048
H  3.55745 -0.089865 -1.608809
H  3.489502 -0.592828 2.651814
H  4.336885 -2.401398 -1.863503
H  4.303085 -2.908047 2.386436
H  4.715008 -3.831007 0.122447
elementType: O C H
totalener: -1117.86238651 hartree
nucrepener: 2333.27080981 hartree
electener: -3451.13319633 hartree
oneelecener: -6155.96412658 hartree
twoeener: 2704.83093025 hartree
cpcmener: -0.02578257 hartree
kineticenergy: 1112.80818374 hartree
xcener: -110.230326949293 hartree
chargesum: 0.0000000
charge: -0.267472 -0.474784 -0.329475 0.090611 -0.001618 -0.108497 -0.273269 -0.286612 -0.280865 0.406246 -0.013055 -0.238239 -0.264318 0.061534 0.030134 -0.298685 -0.197582 0.343931 -0.117089 -0.258173 0.328406 -0.217522 -0.298713 -0.131646 -0.097496 -0.195385 0.112534 0.092070 0.098545 0.087013 0.090170 0.092196 0.097154 0.111901 0.130244 0.097901 0.104957 0.080779 0.100685 0.090142 0.107262 0.116245 0.118771 0.143004 0.139699 0.156370 0.144985 0.155622 0.147131 0.159651 0.157260 0.157343
qa: -0.2675 -0.4748 -0.3295 0.0906 -0.0016 -0.1085 -0.2733 -0.2866 -0.2809 0.4062 -0.0131 -0.2382 -0.2643 0.0615 0.0301 -0.2987 -0.1976 0.3439 -0.1171 -0.2582 0.3284 -0.2175 -0.2987 -0.1316 -0.0975 -0.1954 0.1125 0.0921 0.0985 0.0870 0.0902 0.0922 0.0972 0.1119 0.1302 0.0979 0.1050 0.0808 0.1007 0.0901 0.1073 0.1162 0.1188 0.1430 0.1397 0.1564 0.1450 0.1556 0.1471 0.1597 0.1573 0.1573
va: 2.1089 2.0352 2.0754 3.6827 3.7944 3.8518 3.9121 3.8775 3.8638 4.1611 3.7025 3.9392 3.9384 3.8299 3.6433 3.9252 3.9570 3.6546 3.9043 4.0163 3.6158 3.9150 3.9720 3.8801 3.8367 3.9131 1.0054 1.0268 1.0006 1.0058 1.0037 0.9988 1.0100 1.0032 0.9954 0.9955 0.9979 0.9966 0.9959 1.0050 1.0003 1.0081 0.9976 0.9998 1.0101 0.9896 1.0074 0.9977 1.0105 0.9895 0.9892 0.9908
dispcorr: -0.029047559 hartree
energy: -1117.891434072815
dipole: -16.40717 16.59557 0.18840 -20.21361 18.42187 -1.79173 4.67001 -4.87522 -0.20522
magnitude: 1.81326 au
magnitude: 4.60895 debye
