program: Orca
programVersion: 5.0.2
elementType: O O O C C C C C C C C C C C C C C C C C C C C C C C H H H H H H H H H H H H H H H H H H H H H H H H H H
charge: 0
multiplicity: 1
keywords: wb97x-d3
keywords: def2-TZVPP
keywords: def2/J RIJCOSX
keywords: DEFGRID2
keywords: scfconv7
keywords: smallprint printgap noloewdin
keywords: NOSOSCF
formula: C23H26O3
InChI: InChI=1/C23H26O3/c1-16(2)13-20-21(23(20,3)4)22(24)25-15-17-9-8-12-19(14-17)26-18-10-6-5-7-11-18/h5-14,20-21H,15H2,1-4H3
52 atoms
O  -1.401279 1.646685 0.750083
O  -1.573467 -0.560398 0.468003
O  3.474789 -0.562755 -1.986989
C  -4.50571 0.079347 -0.405691
C  -4.565681 -0.177912 1.058799
C  -3.542089 0.816581 0.511057
C  -5.592072 0.943654 -1.002387
C  -4.012676 -0.982481 -1.357077
C  -4.173678 -1.476877 1.660996
C  -2.102314 0.520177 0.563844
C  -3.665474 -1.629435 2.885837
C  -3.329314 -2.984451 3.428217
C  -3.355445 -0.481807 3.796597
C  0.017438 1.536264 0.78296
C  0.614863 1.240511 -0.565565
C  1.760879 0.459548 -0.636029
C  0.068722 1.770484 -1.731339
C  2.369038 0.231581 -1.86427
C  0.668708 1.509923 -2.95371
C  1.826531 0.749677 -3.029993
C  4.504544 -0.456532 -1.094452
C  5.182729 -1.625543 -0.776569
C  4.909962 0.762921 -0.564419
C  6.272584 -1.572092 0.079877
C  5.994456 0.79845 0.30006
C  6.68071 -0.363384 0.626886
H  -5.373779 0.330643 1.579215
H  -3.777465 1.861135 0.678975
H  -5.24399 1.444277 -1.908117
H  -5.931965 1.712765 -0.307267
H  -6.459008 0.336629 -1.272004
H  -3.285122 -1.663033 -0.924103
H  -3.556444 -0.525888 -2.237674
H  -4.857473 -1.582494 -1.702013
H  -4.347416 -2.365321 1.060462
H  -3.550591 -3.779856 2.716503
H  -3.883422 -3.191173 4.347841
H  -2.268795 -3.049436 3.686373
H  -2.27891 -0.418251 3.979765
H  -3.824328 -0.622074 4.774091
H  -3.682072 0.480469 3.406093
H  0.334242 0.79358 1.518762
H  0.359304 2.510265 1.136293
H  2.172007 0.026512 0.268801
H  -0.824197 2.381493 -1.69497
H  0.238228 1.914133 -3.860801
H  2.301057 0.554401 -3.983394
H  4.859485 -2.56813 -1.200606
H  4.39412 1.679925 -0.820194
H  6.800506 -2.485182 0.323288
H  6.307727 1.74849 0.713574
H  7.52711 -0.326193 1.299929
elementType: O C H
totalener: -1117.86634732 hartree
nucrepener: 2219.97371191 hartree
electener: -3337.84005923 hartree
oneelecener: -5930.11454400 hartree
twoeener: 2592.27448476 hartree
cpcmener: -0.02700539 hartree
kineticenergy: 1112.81092139 hartree
xcener: -110.229136239469 hartree
chargesum: -0.0000000
charge: -0.300966 -0.457203 -0.330164 0.131487 -0.020940 -0.093526 -0.264279 -0.297210 -0.262692 0.375324 -0.023216 -0.224077 -0.267968 0.104810 0.045053 -0.205095 -0.254395 0.260641 -0.112755 -0.249525 0.284005 -0.250249 -0.188388 -0.120510 -0.147637 -0.189638 0.112365 0.093339 0.095478 0.085978 0.093725 0.097525 0.098040 0.099244 0.119424 0.088736 0.094394 0.093640 0.099198 0.105304 0.093017 0.112087 0.120122 0.140615 0.140464 0.155948 0.146551 0.145422 0.154356 0.157734 0.158688 0.157718
qa: -0.3010 -0.4572 -0.3302 0.1315 -0.0209 -0.0935 -0.2643 -0.2972 -0.2627 0.3753 -0.0232 -0.2241 -0.2680 0.1048 0.0451 -0.2051 -0.2544 0.2606 -0.1128 -0.2495 0.2840 -0.2502 -0.1884 -0.1205 -0.1476 -0.1896 0.1124 0.0933 0.0955 0.0860 0.0937 0.0975 0.0980 0.0992 0.1194 0.0887 0.0944 0.0936 0.0992 0.1053 0.0930 0.1121 0.1201 0.1406 0.1405 0.1559 0.1466 0.1454 0.1544 0.1577 0.1587 0.1577
va: 2.1046 2.0295 2.0737 3.7388 3.8447 3.8104 3.9014 3.8988 3.8590 4.0943 3.7138 3.9269 3.9453 3.8075 3.6099 3.9649 3.9597 3.7286 3.8969 4.0208 3.7009 4.0063 3.8976 3.8865 3.8969 3.9074 1.0046 1.0312 1.0024 1.0049 1.0022 1.0151 1.0018 0.9985 1.0009 1.0073 0.9968 0.9965 0.9977 0.9996 1.0055 1.0115 0.9905 1.0074 1.0144 0.9895 1.0061 1.0085 0.9982 0.9890 0.9905 0.9906
dispcorr: -0.024488170 hartree
energy: -1117.890835494396
dipole: -26.41961 25.98273 -0.43688 -4.46663 5.63047 1.16384 11.13539 -10.48521 0.65018
magnitude: 1.40289 au
magnitude: 3.56587 debye
