program: Orca
programVersion: 5.0.2
elementType: O O O C C C C C C C C C C C C C C C C C C C C C C C H H H H H H H H H H H H H H H H H H H H H H H H H H
charge: 0
multiplicity: 1
keywords: wb97x-d3
keywords: def2-TZVPP
keywords: def2/J RIJCOSX
keywords: DEFGRID2
keywords: scfconv7
keywords: smallprint printgap noloewdin
keywords: NOSOSCF
formula: C23H26O3
InChI: InChI=1/C23H26O3/c1-16(2)13-20-21(23(20,3)4)22(24)25-15-17-9-8-12-19(14-17)26-18-10-6-5-7-11-18/h5-14,20-21H,15H2,1-4H3
52 atoms
O  -1.609714 1.140713 -0.992398
O  -1.971427 1.067145 1.209359
O  2.993979 -1.153428 -1.200371
C  -3.475776 -1.592639 0.573563
C  -4.507703 -0.521178 0.522704
C  -3.212649 -0.356446 -0.271536
C  -3.73797 -2.851083 -0.220074
C  -2.696575 -1.852428 1.839022
C  -4.839335 0.325149 1.696858
C  -2.222964 0.667265 0.098135
C  -5.288015 1.580821 1.634107
C  -5.635784 2.348473 2.872311
C  -5.450196 2.33381 0.350335
C  -0.569227 2.103828 -0.799262
C  0.676315 1.470749 -0.246071
C  1.316825 0.47112 -0.972756
C  1.195869 1.864531 0.980039
C  2.454586 -0.135314 -0.464645
C  2.341122 1.25673 1.47616
C  2.973015 0.247328 0.767814
C  4.34913 -1.288438 -1.314918
C  4.844928 -2.583662 -1.383084
C  5.204044 -0.197535 -1.422733
C  6.205939 -2.787375 -1.557005
C  6.564456 -0.417635 -1.58567
C  7.073257 -1.707713 -1.651551
H  -5.351365 -0.728953 -0.131177
H  -3.305578 -0.506294 -1.340946
H  -4.309909 -3.567044 0.374074
H  -2.802566 -3.334253 -0.509694
H  -4.304385 -2.650289 -1.130544
H  -2.547216 -0.972187 2.457604
H  -1.712898 -2.265048 1.606391
H  -3.224283 -2.5921 2.445056
H  -4.735213 -0.135353 2.6753
H  -5.47936 1.762339 3.778063
H  -6.679834 2.672831 2.856489
H  -5.032157 3.256667 2.951287
H  -6.466551 2.724592 0.252694
H  -5.238676 1.732559 -0.532257
H  -4.785224 3.201964 0.328675
H  -0.910274 2.923803 -0.164285
H  -0.3867 2.509054 -1.794489
H  0.931671 0.157196 -1.936459
H  0.703789 2.640582 1.552376
H  2.739166 1.558624 2.43626
H  3.853766 -0.233089 1.175033
H  4.16679 -3.424247 -1.303676
H  4.822338 0.81513 -1.387305
H  6.587966 -3.798711 -1.610875
H  7.229456 0.432495 -1.667976
H  8.135348 -1.869629 -1.779919
elementType: O C H
totalener: -1117.86629264 hartree
nucrepener: 2208.09817348 hartree
electener: -3325.96446612 hartree
oneelecener: -5906.46945410 hartree
twoeener: 2580.50498798 hartree
cpcmener: -0.02592970 hartree
kineticenergy: 1112.81123290 hartree
xcener: -110.227746508686 hartree
chargesum: 0.0000000
charge: -0.296121 -0.464027 -0.328959 0.129305 -0.021029 -0.107768 -0.264293 -0.298691 -0.262731 0.394830 -0.021622 -0.226066 -0.267076 0.096794 0.022370 -0.284668 -0.193179 0.274522 -0.135938 -0.199506 0.288727 -0.251689 -0.193451 -0.121180 -0.148004 -0.187102 0.113586 0.093653 0.093335 0.095724 0.085878 0.095889 0.100528 0.099203 0.119817 0.088682 0.094650 0.093859 0.105529 0.092372 0.098072 0.111963 0.124804 0.129202 0.140433 0.158232 0.156576 0.145204 0.155913 0.157371 0.158820 0.157258
qa: -0.2961 -0.4640 -0.3290 0.1293 -0.0210 -0.1078 -0.2643 -0.2987 -0.2627 0.3948 -0.0216 -0.2261 -0.2671 0.0968 0.0224 -0.2847 -0.1932 0.2745 -0.1359 -0.1995 0.2887 -0.2517 -0.1935 -0.1212 -0.1480 -0.1871 0.1136 0.0937 0.0933 0.0957 0.0859 0.0959 0.1005 0.0992 0.1198 0.0887 0.0946 0.0939 0.1055 0.0924 0.0981 0.1120 0.1248 0.1292 0.1404 0.1582 0.1566 0.1452 0.1559 0.1574 0.1588 0.1573
va: 2.1065 2.0272 2.0732 3.7392 3.8348 3.8248 3.9011 3.8995 3.8564 4.0966 3.7139 3.9266 3.9446 3.8078 3.6177 4.0687 3.9424 3.7364 3.9062 3.9245 3.6918 4.0052 3.9008 3.8889 3.8946 3.9058 1.0048 1.0306 1.0023 1.0024 1.0048 1.0160 1.0009 0.9982 1.0005 1.0075 0.9965 0.9965 0.9992 1.0061 0.9982 1.0081 0.9924 1.0262 1.0090 0.9910 0.9958 1.0087 0.9976 0.9892 0.9905 0.9908
dispcorr: -0.024242965 hartree
energy: -1117.890535609057
dipole: -26.72730 26.82156 0.09426 0.46703 -0.30316 0.16386 8.64205 -9.20336 -0.56131
magnitude: 0.59229 au
magnitude: 1.50547 debye
