program: Orca
programVersion: 5.0.2
elementType: O O O C C C C C C C C C C C C C C C C C C C C C C C H H H H H H H H H H H H H H H H H H H H H H H H H H
charge: 0
multiplicity: 1
keywords: wb97x-d3
keywords: def2-TZVPP
keywords: def2/J RIJCOSX
keywords: DEFGRID2
keywords: scfconv7
keywords: smallprint printgap noloewdin
keywords: NOSOSCF
formula: C23H26O3
InChI: InChI=1/C23H26O3/c1-16(2)13-20-21(23(20,3)4)22(24)25-15-17-9-8-12-19(14-17)26-18-10-6-5-7-11-18/h5-14,20-21H,15H2,1-4H3
52 atoms
O  -1.567119 1.827821 0.567486
O  -1.119885 -0.358767 0.504612
O  3.220883 0.016746 -2.100746
C  -3.99321 -0.660975 -0.653993
C  -4.158959 -0.722035 0.824032
C  -3.366149 0.428468 0.198033
C  -5.185535 -0.213225 -1.467104
C  -3.143361 -1.677089 -1.37564
C  -3.51971 -1.770337 1.65848
C  -1.917594 0.544725 0.428292
C  -3.191771 -1.628205 2.944872
C  -2.58947 -2.755731 3.725617
C  -3.365822 -0.34867 3.702179
C  -0.181103 2.11875 0.775822
C  0.602805 2.033964 -0.503522
C  1.568359 1.049609 -0.672139
C  0.35296 2.940801 -1.53025
C  2.293161 0.988837 -1.856886
C  1.069894 2.859982 -2.713474
C  2.047852 1.890479 -2.882229
C  3.992777 -0.477337 -1.084542
C  4.176001 -1.851669 -1.035589
C  4.626425 0.356397 -0.170744
C  5.00289 -2.395628 -0.062651
C  5.439937 -0.2023 0.804067
C  5.631959 -1.576568 0.864143
H  -5.124596 -0.384281 1.192107
H  -3.881802 1.381446 0.176993
H  -5.792259 0.520563 -0.934453
H  -5.828303 -1.063672 -1.704415
H  -4.871041 0.237583 -2.410499
H  -3.762563 -2.529193 -1.664384
H  -2.314343 -2.060836 -0.788248
H  -2.729538 -1.249938 -2.291224
H  -3.338991 -2.731357 1.185576
H  -1.605951 -2.479811 4.115744
H  -2.470253 -3.656505 3.123369
H  -3.204543 -3.009405 4.593303
H  -2.397177 0.030598 4.040017
H  -3.963648 -0.506888 4.603729
H  -3.84331 0.436801 3.118931
H  0.241363 1.470027 1.54492
H  -0.172468 3.138449 1.160153
H  1.745613 0.332755 0.120413
H  -0.396467 3.712855 -1.40432
H  0.878272 3.565927 -3.51114
H  2.615131 1.830484 -3.802589
H  3.678165 -2.488165 -1.756528
H  4.493892 1.43031 -0.216619
H  5.146702 -3.467867 -0.027205
H  5.93238 0.446245 1.517259
H  6.270406 -2.004593 1.625713
elementType: O C H
totalener: -1117.86647500 hartree
nucrepener: 2244.21835899 hartree
electener: -3362.08483399 hartree
oneelecener: -5978.88859734 hartree
twoeener: 2616.80376336 hartree
cpcmener: -0.02588631 hartree
kineticenergy: 1112.81150940 hartree
xcener: -110.227391355080 hartree
chargesum: 0.0000000
charge: -0.295462 -0.469742 -0.329873 0.135293 -0.026100 -0.114304 -0.263712 -0.300718 -0.262082 0.408143 -0.020724 -0.224905 -0.265563 0.089115 -0.012770 -0.144106 -0.243269 0.253606 -0.115883 -0.249972 0.275799 -0.242332 -0.189264 -0.123211 -0.144570 -0.183712 0.111806 0.092569 0.086040 0.093156 0.095550 0.098919 0.096373 0.100062 0.120063 0.093817 0.088762 0.094145 0.097986 0.104616 0.091686 0.111883 0.127828 0.134343 0.141274 0.156786 0.146253 0.145962 0.155492 0.157585 0.159240 0.158120
qa: -0.2955 -0.4697 -0.3299 0.1353 -0.0261 -0.1143 -0.2637 -0.3007 -0.2621 0.4081 -0.0207 -0.2249 -0.2656 0.0891 -0.0128 -0.1441 -0.2433 0.2536 -0.1159 -0.2500 0.2758 -0.2423 -0.1893 -0.1232 -0.1446 -0.1837 0.1118 0.0926 0.0860 0.0932 0.0956 0.0989 0.0964 0.1001 0.1201 0.0938 0.0888 0.0941 0.0980 0.1046 0.0917 0.1119 0.1278 0.1343 0.1413 0.1568 0.1463 0.1460 0.1555 0.1576 0.1592 0.1581
va: 2.1112 2.0205 2.0748 3.7360 3.8277 3.8276 3.9004 3.8985 3.8551 4.0937 3.7179 3.9264 3.9443 3.8123 3.6359 3.8660 3.9705 3.7517 3.8940 4.0149 3.7028 4.0105 3.9148 3.8843 3.8917 3.9043 1.0056 1.0308 1.0047 1.0024 1.0025 0.9982 1.0164 1.0006 1.0006 0.9968 1.0073 0.9965 0.9978 0.9992 1.0066 1.0106 0.9916 1.0222 1.0066 0.9890 1.0066 1.0079 0.9975 0.9893 0.9902 0.9905
dispcorr: -0.024305519 hartree
energy: -1117.890780516438
dipole: -23.85662 23.27088 -0.58574 -8.63778 9.47133 0.83355 11.27529 -10.65632 0.61897
magnitude: 1.19207 au
magnitude: 3.03000 debye
