program: Orca
programVersion: 5.0.2
elementType: O O O C C C C C C C C C C C C C C C C C C C C C C C H H H H H H H H H H H H H H H H H H H H H H H H H H
charge: 0
multiplicity: 1
keywords: wb97x-d3
keywords: def2-TZVPP
keywords: def2/J RIJCOSX
keywords: DEFGRID2
keywords: scfconv7
keywords: smallprint printgap noloewdin
keywords: NOSOSCF
formula: C23H26O3
InChI: InChI=1/C23H26O3/c1-16(2)13-20-21(23(20,3)4)22(24)25-15-17-9-8-12-19(14-17)26-18-10-6-5-7-11-18/h5-14,20-21H,15H2,1-4H3
52 atoms
O  -1.680627 0.061136 1.424438
O  -0.400282 -1.728623 1.048338
O  3.602417 0.895559 0.008078
C  -3.933014 -1.435895 0.004626
C  -3.232682 -0.673269 -1.067031
C  -2.425438 -1.565917 -0.12698
C  -4.703404 -2.670769 -0.404273
C  -4.567904 -0.714575 1.16819
C  -3.167842 0.810669 -1.083405
C  -1.408354 -1.092479 0.829922
C  -2.165022 1.539564 -1.579234
C  -2.256485 3.032751 -1.661302
C  -0.889306 0.950151 -2.094868
C  -0.717964 0.617133 2.336354
C  0.329441 1.391046 1.588917
C  1.512391 0.772658 1.201765
C  0.098036 2.716877 1.234484
C  2.430488 1.462353 0.421472
C  1.041353 3.410012 0.490159
C  2.204182 2.784593 0.065453
C  3.639579 -0.434169 -0.317602
C  2.620367 -1.051698 -1.034157
C  4.771574 -1.144533 0.055448
C  2.738126 -2.395006 -1.358145
C  4.882019 -2.484526 -0.288951
C  3.864665 -3.118001 -0.98859
H  -3.303702 -1.11557 -2.058417
H  -2.09955 -2.49678 -0.57681
H  -4.77132 -3.381604 0.421915
H  -4.236082 -3.184424 -1.245629
H  -5.721261 -2.409014 -0.70109
H  -4.536222 -1.33037 2.069128
H  -5.619054 -0.522644 0.94225
H  -4.109964 0.242199 1.403077
H  -4.049836 1.332555 -0.721614
H  -2.224473 3.36717 -2.702095
H  -1.41158 3.510665 -1.159939
H  -3.175113 3.414572 -1.215458
H  -0.032938 1.353847 -1.546858
H  -0.733324 1.219702 -3.143211
H  -0.85547 -0.135723 -2.023502
H  -0.27851 -0.162571 2.959001
H  -1.2991 1.27659 2.979227
H  1.705244 -0.248353 1.502597
H  -0.817512 3.207583 1.541544
H  0.865974 4.443898 0.222064
H  2.931762 3.316816 -0.534563
H  1.740531 -0.499306 -1.34003
H  5.560206 -0.650527 0.609261
H  1.94024 -2.875827 -1.909346
H  5.766579 -3.035831 0.003134
H  3.948809 -4.165655 -1.245731
elementType: O C H
totalener: -1117.86262772 hartree
nucrepener: 2374.11521921 hartree
electener: -3491.97784693 hartree
oneelecener: -6238.15687739 hartree
twoeener: 2746.17903047 hartree
cpcmener: -0.02516290 hartree
kineticenergy: 1112.81313087 hartree
xcener: -110.231621630904 hartree
chargesum: 0.0000000
charge: -0.260674 -0.477543 -0.330322 0.142105 -0.014070 -0.157677 -0.268431 -0.298048 -0.255198 0.424586 -0.036004 -0.226711 -0.237641 0.049040 0.009369 -0.183112 -0.247146 0.274460 -0.122641 -0.223899 0.263305 -0.162694 -0.229325 -0.176660 -0.136215 -0.165877 0.113878 0.096018 0.095593 0.085834 0.092619 0.102878 0.097150 0.094188 0.120483 0.101963 0.087257 0.091163 0.059652 0.113753 0.093514 0.120874 0.115038 0.142467 0.147203 0.157741 0.144584 0.160719 0.143925 0.154645 0.156952 0.156934
qa: -0.2607 -0.4775 -0.3303 0.1421 -0.0141 -0.1577 -0.2684 -0.2980 -0.2552 0.4246 -0.0360 -0.2267 -0.2376 0.0490 0.0094 -0.1831 -0.2471 0.2745 -0.1226 -0.2239 0.2633 -0.1627 -0.2293 -0.1767 -0.1362 -0.1659 0.1139 0.0960 0.0956 0.0858 0.0926 0.1029 0.0972 0.0942 0.1205 0.1020 0.0873 0.0912 0.0597 0.1138 0.0935 0.1209 0.1150 0.1425 0.1472 0.1577 0.1446 0.1607 0.1439 0.1546 0.1570 0.1569
va: 2.1187 2.0203 2.0863 3.7072 3.7912 3.8538 3.9044 3.9041 3.8458 4.1064 3.7024 3.9150 3.9445 3.8358 3.5927 3.8784 3.9141 3.7407 3.8621 3.9764 3.7126 3.8513 3.9914 3.9346 3.8938 3.8914 1.0039 1.0279 1.0016 1.0059 1.0022 1.0011 0.9988 1.0095 1.0011 0.9971 1.0013 1.0076 1.0096 1.0039 1.0055 1.0103 0.9992 1.0258 1.0006 0.9892 1.0067 0.9846 1.0084 0.9936 0.9895 0.9904
dispcorr: -0.030481123 hartree
energy: -1117.893108841288
dipole: -23.76893 22.49706 -1.27187 0.66676 -0.06441 0.60235 -7.03099 6.81720 -0.21379
magnitude: 1.42344 au
magnitude: 3.61810 debye
