program: Orca
programVersion: 5.0.2
elementType: O O O C C C C C C C C C C C C C C C C C C C C C C C H H H H H H H H H H H H H H H H H H H H H H H H H H
charge: 0
multiplicity: 1
keywords: wb97x-d3
keywords: def2-TZVPP
keywords: def2/J RIJCOSX
keywords: DEFGRID2
keywords: scfconv7
keywords: smallprint printgap noloewdin
keywords: NOSOSCF
formula: C23H26O3
InChI: InChI=1/C23H26O3/c1-16(2)13-20-21(23(20,3)4)22(24)25-15-17-9-8-12-19(14-17)26-18-10-6-5-7-11-18/h5-14,20-21H,15H2,1-4H3
52 atoms
O  -2.177596 2.32797 0.079441
O  -2.638042 0.861333 -1.534817
O  2.229416 -0.011621 0.712564
C  -4.627538 -0.465247 0.423168
C  -3.301594 -0.931575 0.927675
C  -3.55158 0.566465 0.66913
C  -5.753069 -0.444884 1.431942
C  -5.11339 -0.801717 -0.965566
C  -2.342543 -1.705036 0.111884
C  -2.778647 1.229452 -0.393747
C  -1.18807 -2.216047 0.553581
C  -0.294571 -2.99563 -0.362839
C  -0.662485 -2.063435 1.948022
C  -1.264472 2.989239 -0.795556
C  -0.046945 2.15533 -1.08591
C  0.587302 1.462703 -0.060864
C  0.462206 2.087533 -2.376936
C  1.707702 0.691679 -0.335599
C  1.589132 1.321815 -2.637651
C  2.215592 0.609095 -1.626966
C  3.563778 -0.313644 0.755151
C  3.91474 -1.607738 1.112277
C  4.539497 0.647113 0.517692
C  5.256449 -1.942622 1.232167
C  5.876453 0.294557 0.627981
C  6.241707 -0.997422 0.984097
H  -3.275337 -1.153211 1.989078
H  -3.665414 1.166494 1.564816
H  -6.230945 -1.424936 1.491844
H  -6.518665 0.28114 1.150272
H  -5.402888 -0.186993 2.432596
H  -5.663439 -1.744869 -0.937302
H  -4.328186 -0.902092 -1.708379
H  -5.803019 -0.033648 -1.322256
H  -2.602121 -1.882992 -0.925727
H  -0.70977 -3.087578 -1.366549
H  -0.115193 -4.003323 0.022156
H  0.686314 -2.518769 -0.447888
H  -0.518091 -3.041396 2.414931
H  -1.301667 -1.472746 2.601372
H  0.31948 -1.584218 1.932408
H  -0.988687 3.900547 -0.264303
H  -1.759424 3.285385 -1.722665
H  0.211506 1.503437 0.955316
H  -0.029649 2.620322 -3.181314
H  1.976589 1.258501 -3.646373
H  3.07804 -0.005239 -1.851461
H  3.143503 -2.344746 1.299794
H  4.263771 1.660295 0.251255
H  5.529018 -2.951869 1.513955
H  6.637218 1.041219 0.44038
H  7.286996 -1.263547 1.071356
elementType: O C H
totalener: -1117.86670059 hartree
nucrepener: 2311.46864807 hartree
electener: -3429.33534866 hartree
oneelecener: -6113.30244641 hartree
twoeener: 2683.96709775 hartree
cpcmener: -0.02602198 hartree
kineticenergy: 1112.80745372 hartree
xcener: -110.229606792081 hartree
chargesum: -0.0000000
charge: -0.295013 -0.459150 -0.323352 0.131366 -0.023610 -0.072914 -0.260139 -0.290727 -0.244172 0.369052 -0.040642 -0.224790 -0.263660 0.099495 0.080152 -0.342532 -0.225355 0.310726 -0.117741 -0.218177 0.284574 -0.239323 -0.196485 -0.131614 -0.141430 -0.181004 0.107395 0.092241 0.094951 0.093860 0.086132 0.095315 0.095278 0.099731 0.122871 0.091040 0.098699 0.076492 0.104356 0.090836 0.079632 0.120436 0.112726 0.127401 0.139929 0.158068 0.152507 0.147259 0.155733 0.157684 0.158162 0.157730
qa: -0.2950 -0.4591 -0.3234 0.1314 -0.0236 -0.0729 -0.2601 -0.2907 -0.2442 0.3691 -0.0406 -0.2248 -0.2637 0.0995 0.0802 -0.3425 -0.2254 0.3107 -0.1177 -0.2182 0.2846 -0.2393 -0.1965 -0.1316 -0.1414 -0.1810 0.1074 0.0922 0.0950 0.0939 0.0861 0.0953 0.0953 0.0997 0.1229 0.0910 0.0987 0.0765 0.1044 0.0908 0.0796 0.1204 0.1127 0.1274 0.1399 0.1581 0.1525 0.1473 0.1557 0.1577 0.1582 0.1577
va: 2.1082 2.0337 2.0367 3.7735 3.7769 3.8240 3.8947 3.8884 3.8402 4.1421 3.7290 3.9296 3.9340 3.8016 3.5869 4.0423 3.9750 3.6360 3.9007 3.9384 3.6988 3.9857 3.9390 3.9036 3.8961 3.9016 1.0049 1.0308 1.0023 1.0029 1.0047 1.0001 1.0213 0.9993 1.0082 1.0106 0.9966 0.9995 0.9981 1.0118 1.0150 0.9927 1.0092 1.0311 1.0041 0.9901 1.0005 1.0027 0.9971 0.9904 0.9902 0.9904
dispcorr: -0.027342871 hartree
energy: -1117.894043456231
dipole: -15.06083 15.60380 0.54297 -12.64544 12.85931 0.21387 3.53161 -2.89141 0.64021
magnitude: 0.86627 au
magnitude: 2.20189 debye
