program: Orca
programVersion: 5.0.2
elementType: O O O C C C C C C C C C C C C C C C C C C C C C C C H H H H H H H H H H H H H H H H H H H H H H H H H H
charge: 0
multiplicity: 1
keywords: wb97x-d3
keywords: def2-TZVPP
keywords: def2/J RIJCOSX
keywords: DEFGRID2
keywords: scfconv7
keywords: smallprint printgap noloewdin
keywords: NOSOSCF
formula: C23H26O3
InChI: InChI=1/C23H26O3/c1-16(2)13-20-21(23(20,3)4)22(24)25-15-17-9-8-12-19(14-17)26-18-10-6-5-7-11-18/h5-14,20-21H,15H2,1-4H3
52 atoms
O  -2.18462 2.113973 0.265646
O  -2.480875 0.700644 -1.435029
O  2.828141 1.113538 0.95411
C  -4.585785 -0.700484 0.373706
C  -3.283986 -1.308226 0.754958
C  -3.428056 0.219145 0.719327
C  -5.681949 -0.730711 1.412729
C  -5.120092 -0.80853 -1.032812
C  -2.4090 -2.02318 -0.205712
C  -2.675615 0.993449 -0.277271
C  -1.09114 -2.168329 -0.047838
C  -0.256375 -2.896351 -1.054791
C  -0.339813 -1.579252 1.105591
C  -1.39185 2.959449 -0.572964
C  -0.042911 2.371025 -0.878727
C  0.787009 1.959628 0.159493
C  0.39334 2.249351 -2.192021
C  2.043798 1.445482 -0.120239
C  1.658712 1.745191 -2.459569
C  2.495175 1.342761 -1.430606
C  3.638863 0.007682 0.911959
C  3.259034 -1.176457 0.291066
C  4.850718 0.097188 1.583346
C  4.108291 -2.272171 0.34617
C  5.685511 -1.009787 1.637139
C  5.322302 -2.197112 1.016209
H  -3.229351 -1.676607 1.775974
H  -3.49076 0.699623 1.688621
H  -6.234866 -1.670002 1.354845
H  -6.392698 0.083059 1.256952
H  -5.286769 -0.639768 2.424938
H  -4.354859 -0.892887 -1.79844
H  -5.738175 0.057894 -1.27422
H  -5.755711 -1.692408 -1.108189
H  -2.877608 -2.45654 -1.083916
H  0.269661 -3.737938 -0.597837
H  0.513927 -2.238582 -1.466506
H  -0.851071 -3.27765 -1.884632
H  -0.983491 -1.273576 1.929107
H  0.217717 -0.695198 0.782982
H  0.396409 -2.284813 1.496984
H  -1.283383 3.88033 -0.001658
H  -1.926013 3.20137 -1.493235
H  0.464577 2.044461 1.190824
H  -0.252781 2.552458 -3.006003
H  2.000826 1.660794 -3.482349
H  3.48275 0.958194 -1.650392
H  2.312435 -1.254693 -0.228376
H  5.133314 1.025034 2.064636
H  3.809381 -3.193746 -0.135955
H  6.628631 -0.9375 2.16303
H  5.977086 -3.057111 1.056522
elementType: O C H
totalener: -1117.85288316 hartree
nucrepener: 2325.55850648 hartree
electener: -3443.41138964 hartree
oneelecener: -6141.31782431 hartree
twoeener: 2697.90643467 hartree
cpcmener: -0.03187989 hartree
kineticenergy: 1112.81675846 hartree
xcener: -110.233400717971 hartree
chargesum: 0.0000000
charge: -0.300338 -0.493379 -0.343633 0.133809 -0.020279 -0.104447 -0.263623 -0.298023 -0.269115 0.408868 0.013418 -0.248289 -0.291929 0.103866 0.036286 -0.325031 -0.198765 0.297537 -0.145413 -0.191316 0.322869 -0.206561 -0.244090 -0.178228 -0.132845 -0.177013 0.111027 0.091833 0.094470 0.095670 0.087958 0.090270 0.102983 0.099532 0.126602 0.099111 0.096855 0.097349 0.107613 0.078817 0.110295 0.125483 0.114802 0.138067 0.146409 0.162322 0.157179 0.151888 0.146943 0.160206 0.160798 0.161183
qa: -0.3003 -0.4934 -0.3436 0.1338 -0.0203 -0.1044 -0.2636 -0.2980 -0.2691 0.4089 0.0134 -0.2483 -0.2919 0.1039 0.0363 -0.3250 -0.1988 0.2975 -0.1454 -0.1913 0.3229 -0.2066 -0.2441 -0.1782 -0.1328 -0.1770 0.1110 0.0918 0.0945 0.0957 0.0880 0.0903 0.1030 0.0995 0.1266 0.0991 0.0969 0.0973 0.1076 0.0788 0.1103 0.1255 0.1148 0.1381 0.1464 0.1623 0.1572 0.1519 0.1469 0.1602 0.1608 0.1612
va: 2.1088 1.9936 2.0566 3.7517 3.8062 3.8456 3.8991 3.8941 3.8260 4.0786 3.6352 3.9330 3.9675 3.7919 3.5969 3.9794 3.9436 3.6796 3.9038 3.8999 3.6290 3.8739 3.9965 3.9366 3.8884 3.8943 1.0068 1.0317 1.0021 1.0024 1.0045 1.0176 0.9998 0.9985 0.9997 0.9970 0.9927 1.0088 1.0098 0.9937 1.0009 0.9930 1.0077 1.0248 1.0040 0.9896 0.9956 0.9863 1.0083 0.9917 0.9880 0.9889
dispcorr: -0.028537253 hartree
energy: -1117.881420415062
dipole: -16.41943 16.48775 0.06832 -14.26786 14.11120 -0.15666 0.18137 0.33624 0.51761
magnitude: 0.54509 au
magnitude: 1.38552 debye
