program: Orca
programVersion: 5.0.2
elementType: O O O C C C C C C C C C C C C C C C C C C C C C C C H H H H H H H H H H H H H H H H H H H H H H H H H H
charge: 0
multiplicity: 1
keywords: wb97x-d3
keywords: def2-TZVPP
keywords: def2/J RIJCOSX
keywords: DEFGRID2
keywords: scfconv7
keywords: smallprint printgap noloewdin
keywords: NOSOSCF
formula: C23H26O3
InChI: InChI=1/C23H26O3/c1-16(2)13-20-21(23(20,3)4)22(24)25-15-17-9-8-12-19(14-17)26-18-10-6-5-7-11-18/h5-14,20-21H,15H2,1-4H3
52 atoms
O  -1.182886 -0.585695 1.967443
O  -2.573077 1.098078 1.496866
O  2.936544 0.383465 -1.16631
C  -4.473646 -1.021137 0.269029
C  -3.447129 -0.788361 -0.783973
C  -3.012812 -1.106883 0.657839
C  -5.18193 -2.356605 0.242122
C  -5.367552 0.095423 0.749609
C  -3.192198 0.540865 -1.388801
C  -2.282667 -0.072981 1.403757
C  -2.062831 0.857077 -2.029035
C  -1.868789 2.198597 -2.663791
C  -0.920978 -0.106032 -2.172367
C  -0.253562 0.329299 2.56516
C  0.523634 1.072441 1.515088
C  1.388393 0.366034 0.684668
C  0.374679 2.44435 1.347689
C  2.105228 1.038895 -0.293794
C  1.087028 3.104152 0.356052
C  1.957636 2.40772 -0.467978
C  3.747206 -0.625782 -0.709029
C  4.407595 -0.548199 0.511447
C  3.933037 -1.716516 -1.546628
C  5.249093 -1.583313 0.892415
C  4.787305 -2.738605 -1.157143
C  5.442782 -2.681834 0.06512
H  -3.264549 -1.628959 -1.447845
H  -2.627348 -2.108807 0.804692
H  -6.049474 -2.315057 -0.419037
H  -5.535617 -2.631656 1.23745
H  -4.530776 -3.155712 -0.114172
H  -5.667736 -0.074211 1.784958
H  -6.276907 0.110515 0.145917
H  -4.922781 1.084095 0.691959
H  -3.982203 1.282987 -1.329046
H  -2.747546 2.834872 -2.561871
H  -1.641063 2.101214 -3.728482
H  -1.018306 2.718429 -2.213652
H  -1.030912 -0.706944 -3.079097
H  -0.845152 -0.797069 -1.333347
H  0.030279 0.419011 -2.261389
H  0.406026 -0.3019 3.15889
H  -0.761482 1.016313 3.243144
H  1.500076 -0.705231 0.806652
H  -0.297425 2.997066 1.991265
H  0.969245 4.171593 0.22472
H  2.518681 2.919468 -1.23939
H  4.274918 0.306697 1.162115
H  3.415591 -1.762081 -2.496519
H  5.760932 -1.523803 1.843955
H  4.931464 -3.587267 -1.812818
H  6.10167 -3.483945 0.369427
elementType: O C H
totalener: -1117.85215120 hartree
nucrepener: 2318.94003576 hartree
electener: -3436.79218696 hartree
oneelecener: -6128.26005148 hartree
twoeener: 2691.46786452 hartree
cpcmener: -0.03080388 hartree
kineticenergy: 1112.80608540 hartree
xcener: -110.229013290884 hartree
chargesum: -0.0000000
charge: -0.297277 -0.491258 -0.347933 0.139293 -0.022592 -0.096269 -0.265460 -0.295949 -0.280691 0.389668 -0.006204 -0.215020 -0.309867 0.094771 0.022864 -0.216931 -0.181107 0.252817 -0.149913 -0.230187 0.286346 -0.192583 -0.255088 -0.150989 -0.125071 -0.188950 0.115809 0.094753 0.094965 0.096055 0.088134 0.102685 0.098759 0.089727 0.126972 0.089008 0.102601 0.085772 0.124304 0.098493 0.097834 0.127446 0.115146 0.143408 0.143937 0.159481 0.148795 0.156400 0.147715 0.161999 0.161603 0.161773
qa: -0.2973 -0.4913 -0.3479 0.1393 -0.0226 -0.0963 -0.2655 -0.2959 -0.2807 0.3897 -0.0062 -0.2150 -0.3099 0.0948 0.0229 -0.2169 -0.1811 0.2528 -0.1499 -0.2302 0.2863 -0.1926 -0.2551 -0.1510 -0.1251 -0.1890 0.1158 0.0948 0.0950 0.0961 0.0881 0.1027 0.0988 0.0897 0.1270 0.0890 0.1026 0.0858 0.1243 0.0985 0.0978 0.1274 0.1151 0.1434 0.1439 0.1595 0.1488 0.1564 0.1477 0.1620 0.1616 0.1618
va: 2.1040 1.9941 2.0190 3.7617 3.7895 3.8344 3.8966 3.8881 3.8277 4.1275 3.6759 3.9198 3.9657 3.8017 3.5763 3.8751 3.8998 3.6048 3.8919 3.9755 3.6896 3.8996 4.0020 3.8909 3.8801 3.8984 1.0031 1.0316 1.0023 1.0022 1.0041 0.9995 0.9990 1.0185 1.0009 1.0085 0.9947 0.9970 0.9975 0.9983 0.9977 0.9946 1.0084 1.0133 1.0095 0.9895 1.0046 0.9982 1.0079 0.9896 0.9882 0.9893
dispcorr: -0.028087472 hartree
energy: -1117.880238671215
dipole: -20.03758 20.54314 0.50555 -2.68738 1.60283 -1.08455 -6.59772 6.75828 0.16057
magnitude: 1.20731 au
magnitude: 3.06875 debye
